BDBM50004117 1-Ethoxymethyl-5-ethyl-6-phenylsulfanyl-2-thioxo-2,3-dihydro-1H-pyrimidin-4-one::CHEMBL422622
SMILES: CCOCn1c(Sc2ccccc2)c(CC)c(=O)[nH]c1=S
InChI Key: InChIKey=HAPGQEOFYIIJAE-UHFFFAOYSA-N
Data: 1 EC50
Activity Spreadsheet -- Enzyme Inhibition Constant Data from BindingDB
Found 1 hit for monomerid = 50004117
Trg + Lig
Ki
nM
ΔG°
kcal/mole
IC50
nM
Kd
nM
EC50/IC50
nM
koff
s-1
kon
M-1s-1
pHTemp
°C
Human immunodeficiency virus type 1 reverse transcriptase
(Human immunodeficiency virus 1)
BDBM50004117
(1-Ethoxymethyl-5-ethyl-6-phenylsulfanyl-2-thioxo-2...)
Show SMILES CCOCn1c(Sc2ccccc2)c(CC)c(=O)[nH]c1=S
Show InChI InChI=1S/C15H18N2O2S2/c1-3-12-13(18)16-15(20)17(10-19-4-2)14(12)21-11-8-6-5-7-9-11/h5-9H,3-4,10H2,1-2H3,(H,16,18,20)
n/an/an/an/a 26n/an/an/an/a
Université d'Orléans
Curated by ChEMBL
Assay Description
Inhibitory concentration against HIV-1 reverse transcriptase
J Med Chem 40: 4257-64 (1998)
Article DOI: 10.1021/jm970110p
BindingDB Entry DOI: 10.7270/Q2WS8SC3