null
SMILES: CCCCn1c(Sc2ccccc2)c(C)c(=O)[nH]c1=O
InChI Key: InChIKey=LRAWIWVJQCNVJX-UHFFFAOYSA-N
Activity Spreadsheet -- Enzyme Inhibition Constant Data from BindingDB
Found 2 hits for monomerid = 50004132
Trg + Lig
Ki
nM
ΔG°
kcal/mole
IC50
nM
Kd
nM
EC50/IC50
nM
koff
s-1
kon
M-1s-1
pHTemp
°C
Reverse transcriptase/RNaseH
(Human immunodeficiency virus 1)
BDBM50004132
(1-Butyl-5-methyl-6-phenylsulfanyl-1H-pyrimidine-2,...)
Show SMILES CCCCn1c(Sc2ccccc2)c(C)c(=O)[nH]c1=O
Show InChI InChI=1S/C15H18N2O2S/c1-3-4-10-17-14(11(2)13(18)16-15(17)19)20-12-8-6-5-7-9-12/h5-9H,3-4,10H2,1-2H3,(H,16,18,19)
n/an/an/an/a 1.20E+3n/an/an/an/a
Yale University
Curated by ChEMBL
Assay Description
Inhibition of HIV-1 reverse transcriptase at 37 degree centigrade
J Med Chem 44: 145-54 (2001)
BindingDB Entry DOI: 10.7270/Q2VX0FRX
Reverse transcriptase/RNaseH
(Human immunodeficiency virus 1)
BDBM50004132
(1-Butyl-5-methyl-6-phenylsulfanyl-1H-pyrimidine-2,...)
Show SMILES CCCCn1c(Sc2ccccc2)c(C)c(=O)[nH]c1=O
Show InChI InChI=1S/C15H18N2O2S/c1-3-4-10-17-14(11(2)13(18)16-15(17)19)20-12-8-6-5-7-9-12/h5-9H,3-4,10H2,1-2H3,(H,16,18,19)
n/an/an/an/a 1.20E+3n/an/an/an/a
Université d'Orléans
Curated by ChEMBL
Assay Description
Inhibitory concentration against HIV-1 reverse transcriptase
J Med Chem 40: 4257-64 (1998)
Article DOI: 10.1021/jm970110p
BindingDB Entry DOI: 10.7270/Q2WS8SC3