null
SMILES: CN1CCN(CC1)c1cc(Nc2cc(C)[nH]n2)nc(Nc2ccc(Cl)cc2)n1
InChI Key: InChIKey=YXABNRNUULGJNP-UHFFFAOYSA-N
Activity Spreadsheet -- Enzyme Inhibition Constant Data from BindingDB
Found 1 hit for monomerid = 50004223
Trg + Lig
Ki
nM
ΔG°
kcal/mole
IC50
nM
Kd
nM
EC50/IC50
nM
koff
s-1
kon
M-1s-1
pHTemp
°C
Aurora kinase A
(Homo sapiens (Human))
BDBM50004223
(CHEMBL3237188)
Show SMILES CN1CCN(CC1)c1cc(Nc2cc(C)[nH]n2)nc(Nc2ccc(Cl)cc2)n1
Show InChI InChI=1S/C19H23ClN8/c1-13-11-17(26-25-13)22-16-12-18(28-9-7-27(2)8-10-28)24-19(23-16)21-15-5-3-14(20)4-6-15/h3-6,11-12H,7-10H2,1-2H3,(H3,21,22,23,24,25,26)
NCI pathway
Reactome pathway
n/an/a 13n/an/an/an/an/an/a
Sun Yat-sen University
Curated by ChEMBL
Assay Description
Inhibition of Aurora A (unknown origin) using FAM-labeled peptide as substrate preincubated for 10 mins followed by substrate addition measured after...
Eur J Med Chem 78: 65-71 (2014)
Article DOI: 10.1016/j.ejmech.2014.03.027
BindingDB Entry DOI: 10.7270/Q2Z60QKP