null
SMILES: CN1CCN(CC1)c1cc(Nc2cc(C)[nH]n2)nc(Nc2ccc(cc2)S(N)(=O)=O)n1
InChI Key: InChIKey=RREAWCDQHHDDOO-UHFFFAOYSA-N
Activity Spreadsheet -- Enzyme Inhibition Constant Data from BindingDB
Found 2 hits for monomerid = 50004231
Trg + Lig
Ki
nM
ΔG°
kcal/mole
IC50
nM
Kd
nM
EC50/IC50
nM
koff
s-1
kon
M-1s-1
pHTemp
°C
Aurora kinase A
(Homo sapiens (Human))
BDBM50004231
(CHEMBL3237167)
Show SMILES CN1CCN(CC1)c1cc(Nc2cc(C)[nH]n2)nc(Nc2ccc(cc2)S(N)(=O)=O)n1
Show InChI InChI=1S/C19H25N9O2S/c1-13-11-17(26-25-13)22-16-12-18(28-9-7-27(2)8-10-28)24-19(23-16)21-14-3-5-15(6-4-14)31(20,29)30/h3-6,11-12H,7-10H2,1-2H3,(H2,20,29,30)(H3,21,22,23,24,25,26)
NCI pathway
Reactome pathway
n/an/a 5n/an/an/an/an/an/a
Jouf University
Curated by ChEMBL
Assay Description
Inhibition of AURKA (unknown origin)
Bioorg Med Chem 28: (2020)
Aurora kinase A
(Homo sapiens (Human))
BDBM50004231
(CHEMBL3237167)
Show SMILES CN1CCN(CC1)c1cc(Nc2cc(C)[nH]n2)nc(Nc2ccc(cc2)S(N)(=O)=O)n1
Show InChI InChI=1S/C19H25N9O2S/c1-13-11-17(26-25-13)22-16-12-18(28-9-7-27(2)8-10-28)24-19(23-16)21-14-3-5-15(6-4-14)31(20,29)30/h3-6,11-12H,7-10H2,1-2H3,(H2,20,29,30)(H3,21,22,23,24,25,26)
NCI pathway
Reactome pathway
n/an/a 5n/an/an/an/an/an/a
Sun Yat-sen University
Curated by ChEMBL
Assay Description
Inhibition of Aurora A (unknown origin) using FAM-labeled peptide as substrate preincubated for 10 mins followed by substrate addition measured after...
Eur J Med Chem 78: 65-71 (2014)
Article DOI: 10.1016/j.ejmech.2014.03.027
BindingDB Entry DOI: 10.7270/Q2Z60QKP