BDBM50004700 (17S, 18S, 21S, 22R)-reticulation-1
SMILES: CCCCCCCCCCCC[C@@H](O)[C@H]1CC[C@@H](O1)[C@@H](O)CCCCCCCCCCCCCCC1=C[C@H](C)OC1=O
InChI Key: InChIKey=BDGWQMLWIGDEKO-RMZJEPJKSA-N
Data: 1 IC50
Activity Spreadsheet -- Enzyme Inhibition Constant Data from BindingDB
Found 1 hit for monomerid = 50004700
Trg + Lig
Ki
nM
ΔG°
kcal/mole
IC50
nM
Kd
nM
EC50/IC50
nM
koff
s-1
kon
M-1s-1
pHTemp
°C
NADH-ubiquinone oxidoreductase
(Bos taurus (Bovine))
BDBM50004700
((17S, 18S, 21S, 22R)-reticulation-1)
Show SMILES CCCCCCCCCCCC[C@@H](O)[C@H]1CC[C@@H](O1)[C@@H](O)CCCCCCCCCCCCCCC1=C[C@H](C)OC1=O |r,t:36|
Show InChI InChI=1S/C37H68O5/c1-3-4-5-6-7-8-14-17-20-23-26-33(38)35-28-29-36(42-35)34(39)27-24-21-18-15-12-10-9-11-13-16-19-22-25-32-30-31(2)41-37(32)40/h30-31,33-36,38-39H,3-29H2,1-2H3/t31-,33+,34-,35+,36+/m0/s1
n/an/a 17n/an/an/an/an/an/a
TBA
Assay Description
Inhibition of Bos taurus (bovine) mitochodrial complex 1 isolated from heart submitochondrial particle by NADH oxidase assay
Citation and Details
Article DOI: 10.1016/j.tet.2004.09.011
BindingDB Entry DOI: 10.7270/Q2HD7X5G