BDBM50004849 CHEMBL2324050
SMILES: CC1(Cc2ccccc2)CC(=NO1)c1ccc(Cl)cc1
InChI Key: InChIKey=VQZLZKMDVOHZKK-UHFFFAOYSA-N
Data: 1 IC50
Activity Spreadsheet -- Enzyme Inhibition Constant Data from BindingDB
Found 1 hit for monomerid = 50004849
Trg + Lig
Ki
nM
ΔG°
kcal/mole
IC50
nM
Kd
nM
EC50/IC50
nM
koff
s-1
kon
M-1s-1
pHTemp
°C
Luciferin 4-monooxygenase
(Photinus pyralis)
BDBM50004849
(CHEMBL2324050)
Show SMILES CC1(Cc2ccccc2)CC(=NO1)c1ccc(Cl)cc1 |c:11|
Show InChI InChI=1S/C17H16ClNO/c1-17(11-13-5-3-2-4-6-13)12-16(19-20-17)14-7-9-15(18)10-8-14/h2-10H,11-12H2,1H3
n/an/a 32n/an/an/an/an/an/a
University of Eastern Finland
Curated by ChEMBL
Assay Description
Inhibition of recombinant firefly luciferase after 20 mins by luminescence assay
J Med Chem 56: 1064-73 (2013)
Article DOI: 10.1021/jm301516q
BindingDB Entry DOI: 10.7270/Q20G3MP0