BDBM50004855 CHEMBL2324090
SMILES: COc1ccc(cc1)C1=NO[C@H](CCc2ccccc2)C1
InChI Key: InChIKey=HXWGKLYJZNNZHO-QGZVFWFLSA-N
Data: 1 IC50
Activity Spreadsheet -- Enzyme Inhibition Constant Data from BindingDB
Found 1 hit for monomerid = 50004855
Trg + Lig
Ki
nM
ΔG°
kcal/mole
IC50
nM
Kd
nM
EC50/IC50
nM
koff
s-1
kon
M-1s-1
pHTemp
°C
Luciferin 4-monooxygenase
(Photinus pyralis)
BDBM50004855
(CHEMBL2324090)
Show SMILES COc1ccc(cc1)C1=NO[C@H](CCc2ccccc2)C1 |r,t:9|
Show InChI InChI=1S/C18H19NO2/c1-20-16-11-8-15(9-12-16)18-13-17(21-19-18)10-7-14-5-3-2-4-6-14/h2-6,8-9,11-12,17H,7,10,13H2,1H3/t17-/m1/s1
n/an/a 14n/an/an/an/an/an/a
University of Eastern Finland
Curated by ChEMBL
Assay Description
Inhibition of recombinant firefly luciferase after 20 mins by luminescence assay
J Med Chem 56: 1064-73 (2013)
Article DOI: 10.1021/jm301516q
BindingDB Entry DOI: 10.7270/Q20G3MP0