BDBM50004872 CHEMBL2324097
SMILES: Oc1cccc(c1)C1=NO[C@H](Cc2ccccc2)C1
InChI Key: InChIKey=CMZNXRVWBPGLJF-OAHLLOKOSA-N
Data: 1 IC50
Activity Spreadsheet -- Enzyme Inhibition Constant Data from BindingDB
Found 1 hit for monomerid = 50004872
Trg + Lig
Ki
nM
ΔG°
kcal/mole
IC50
nM
Kd
nM
EC50/IC50
nM
koff
s-1
kon
M-1s-1
pHTemp
°C
Luciferin 4-monooxygenase
(Photinus pyralis)
BDBM50004872
(CHEMBL2324097)
Show SMILES Oc1cccc(c1)C1=NO[C@H](Cc2ccccc2)C1 |r,t:8|
Show InChI InChI=1S/C16H15NO2/c18-14-8-4-7-13(10-14)16-11-15(19-17-16)9-12-5-2-1-3-6-12/h1-8,10,15,18H,9,11H2/t15-/m1/s1
n/an/a 0.830n/an/an/an/an/an/a
University of Eastern Finland
Curated by ChEMBL
Assay Description
Inhibition of recombinant firefly luciferase after 20 mins by luminescence assay
J Med Chem 56: 1064-73 (2013)
Article DOI: 10.1021/jm301516q
BindingDB Entry DOI: 10.7270/Q20G3MP0