BDBM50004873 CHEMBL2324053
SMILES: [O-][N+](=O)c1ccc(cc1)C1=NOC(Cc2ccccc2)C1
InChI Key: InChIKey=IISSBZMWJYMUSP-UHFFFAOYSA-N
Data: 1 IC50
Activity Spreadsheet -- Enzyme Inhibition Constant Data from BindingDB
Found 1 hit for monomerid = 50004873
Trg + Lig
Ki
nM
ΔG°
kcal/mole
IC50
nM
Kd
nM
EC50/IC50
nM
koff
s-1
kon
M-1s-1
pHTemp
°C
Luciferin 4-monooxygenase
(Photinus pyralis)
BDBM50004873
(CHEMBL2324053)
Show SMILES [O-][N+](=O)c1ccc(cc1)C1=NOC(Cc2ccccc2)C1 |t:10|
Show InChI InChI=1S/C16H14N2O3/c19-18(20)14-8-6-13(7-9-14)16-11-15(21-17-16)10-12-4-2-1-3-5-12/h1-9,15H,10-11H2
n/an/a 0.740n/an/an/an/an/an/a
University of Eastern Finland
Curated by ChEMBL
Assay Description
Inhibition of recombinant firefly luciferase after 20 mins by luminescence assay
J Med Chem 56: 1064-73 (2013)
Article DOI: 10.1021/jm301516q
BindingDB Entry DOI: 10.7270/Q20G3MP0