null
SMILES: CC1=NN(C(=O)\C1=C/C=C/c1ccccc1)c1ccc(cc1)S(N)(=O)=O
InChI Key: InChIKey=FARYOKAWTPICDA-WCTLISOUSA-N
Activity Spreadsheet -- Enzyme Inhibition Constant Data from BindingDB
Found 3 hits for monomerid = 50004961
Trg + Lig
Ki
nM
ΔG°
kcal/mole
IC50
nM
Kd
nM
EC50/IC50
nM
koff
s-1
kon
M-1s-1
pHTemp
°C
Carbonic anhydrase 9
(Homo sapiens (Human))
BDBM50004961
(CHEMBL2392428)
Show SMILES CC1=NN(C(=O)\C1=C/C=C/c1ccccc1)c1ccc(cc1)S(N)(=O)=O |t:1|
Show InChI InChI=1S/C19H17N3O3S/c1-14-18(9-5-8-15-6-3-2-4-7-15)19(23)22(21-14)16-10-12-17(13-11-16)26(20,24)25/h2-13H,1H3,(H2,20,24,25)/b8-5+,18-9-
NCI pathway
Reactome pathway
n/an/a 19n/an/an/an/an/an/a
East China University of Science and Technology
Curated by ChEMBL
Assay Description
Inhibition of GST-tagged recombinant carbonic anhydrase-9 catalytic domain (unknown origin)
Bioorg Med Chem Lett 23: 3496-9 (2013)
Article DOI: 10.1016/j.bmcl.2013.04.048
BindingDB Entry DOI: 10.7270/Q2GH9KFD
Carbonic anhydrase 1
(Homo sapiens (Human))
BDBM50004961
(CHEMBL2392428)
Show SMILES CC1=NN(C(=O)\C1=C/C=C/c1ccccc1)c1ccc(cc1)S(N)(=O)=O |t:1|
Show InChI InChI=1S/C19H17N3O3S/c1-14-18(9-5-8-15-6-3-2-4-7-15)19(23)22(21-14)16-10-12-17(13-11-16)26(20,24)25/h2-13H,1H3,(H2,20,24,25)/b8-5+,18-9-
NCI pathway
Reactome pathway
n/an/a 3.10n/an/an/an/an/an/a
East China University of Science and Technology
Curated by ChEMBL
Assay Description
Inhibition of full length carbonic anhydrase-1 in human erythrocytes
Bioorg Med Chem Lett 23: 3496-9 (2013)
Article DOI: 10.1016/j.bmcl.2013.04.048
BindingDB Entry DOI: 10.7270/Q2GH9KFD
Carbonic anhydrase 2
(Homo sapiens (Human))
BDBM50004961
(CHEMBL2392428)
Show SMILES CC1=NN(C(=O)\C1=C/C=C/c1ccccc1)c1ccc(cc1)S(N)(=O)=O |t:1|
Show InChI InChI=1S/C19H17N3O3S/c1-14-18(9-5-8-15-6-3-2-4-7-15)19(23)22(21-14)16-10-12-17(13-11-16)26(20,24)25/h2-13H,1H3,(H2,20,24,25)/b8-5+,18-9-
Reactome pathway
n/an/a 33n/an/an/an/an/an/a
East China University of Science and Technology
Curated by ChEMBL
Assay Description
Inhibition of full length carbonic anhydrase-2 in human erythrocytes
Bioorg Med Chem Lett 23: 3496-9 (2013)
Article DOI: 10.1016/j.bmcl.2013.04.048
BindingDB Entry DOI: 10.7270/Q2GH9KFD