BDBM50005060 CHEMBL1915519
SMILES: CCCOc1ccc(cc1-c1nc(CC)c(Br)c(=O)[nH]1)S(=O)(=O)N1CCN(C)CC1
InChI Key: InChIKey=QERPGINNBBVVSA-UHFFFAOYSA-N
Data: 1 Kd
PDB links: 1 PDB ID matches this monomer.
Activity Spreadsheet -- Enzyme Inhibition Constant Data from BindingDB
Found 1 hit for monomerid = 50005060
Trg + Lig
Ki
nM
ΔG°
kcal/mole
IC50
nM
Kd
nM
EC50/IC50
nM
koff
s-1
kon
M-1s-1
pHTemp
°C
cGMP-specific 3',5'-cyclic phosphodiesterase
(Homo sapiens (Human))
BDBM50005060
(CHEMBL1915519)
Show SMILES CCCOc1ccc(cc1-c1nc(CC)c(Br)c(=O)[nH]1)S(=O)(=O)N1CCN(C)CC1
Show InChI InChI=1S/C20H27BrN4O4S/c1-4-12-29-17-7-6-14(30(27,28)25-10-8-24(3)9-11-25)13-15(17)19-22-16(5-2)18(21)20(26)23-19/h6-7,13H,4-5,8-12H2,1-3H3,(H,22,23,26)
Reactome pathway
n/an/an/a 420n/an/an/an/an/a
Chinese Academy of Sciences (CAS)
Curated by ChEMBL
Assay Description
Binding affinity to recombinant PDE5 catalytic domain (unknown origin) by ITC analysis
J Med Chem 57: 3588-93 (2014)
Article DOI: 10.1021/jm5002315
BindingDB Entry DOI: 10.7270/Q24Q7WH7
3D
3D Structure (crystal)