BDBM50005277 CHEMBL3114517
SMILES: O=C(NCc1ccccc1)c1nc2c(cccc2[nH]1)-c1ccccc1
InChI Key: InChIKey=AIFHFYUGIKYJLC-UHFFFAOYSA-N
Data: 2 EC50
Activity Spreadsheet -- Enzyme Inhibition Constant Data from BindingDB
Found 2 hits for monomerid = 50005277
Trg + Lig
Ki
nM
ΔG°
kcal/mole
IC50
nM
Kd
nM
EC50/IC50
nM
koff
s-1
kon
M-1s-1
pHTemp
°C
Cannabinoid receptor 2
(Homo sapiens (Human))
BDBM50005277
(CHEMBL3114517)
Show SMILES O=C(NCc1ccccc1)c1nc2c(cccc2[nH]1)-c1ccccc1
Show InChI InChI=1S/C21H17N3O/c25-21(22-14-15-8-3-1-4-9-15)20-23-18-13-7-12-17(19(18)24-20)16-10-5-2-6-11-16/h1-13H,14H2,(H,22,25)(H,23,24)
Reactome pathway
n/an/an/an/a 991n/an/an/an/a
Merck Research Laboratories
Curated by ChEMBL
Assay Description
Agonist activity at human CB2 receptor expressed in CHO-K1 cells assessed as forskolin-induced cAMP accumulation after 1 hr
Bioorg Med Chem Lett 24: 1218-21 (2014)
Article DOI: 10.1016/j.bmcl.2013.12.068
BindingDB Entry DOI: 10.7270/Q2FJ2J9K
Cannabinoid receptor 1
(Homo sapiens (Human))
BDBM50005277
(CHEMBL3114517)
Show SMILES O=C(NCc1ccccc1)c1nc2c(cccc2[nH]1)-c1ccccc1
Show InChI InChI=1S/C21H17N3O/c25-21(22-14-15-8-3-1-4-9-15)20-23-18-13-7-12-17(19(18)24-20)16-10-5-2-6-11-16/h1-13H,14H2,(H,22,25)(H,23,24)
NCI pathway
Reactome pathway
n/an/an/an/a>1.70E+4n/an/an/an/a
Merck Research Laboratories
Curated by ChEMBL
Assay Description
Agonist activity at human CB1 receptor expressed in CHO-K1 cells assessed as forskolin-induced cAMP accumulation after 1 hr
Bioorg Med Chem Lett 24: 1218-21 (2014)
Article DOI: 10.1016/j.bmcl.2013.12.068
BindingDB Entry DOI: 10.7270/Q2FJ2J9K