BDBM50005279 CHEMBL3114515
SMILES: FC(F)(F)c1cccc(CNC(=O)c2nc3c(cccc3[nH]2)-c2ccccc2)c1
InChI Key: InChIKey=OSGCZBSBEOQWOA-UHFFFAOYSA-N
Data: 2 EC50
Activity Spreadsheet -- Enzyme Inhibition Constant Data from BindingDB
Found 2 hits for monomerid = 50005279
Trg + Lig
Ki
nM
ΔG°
kcal/mole
IC50
nM
Kd
nM
EC50/IC50
nM
koff
s-1
kon
M-1s-1
pHTemp
°C
Cannabinoid receptor 2
(Homo sapiens (Human))
BDBM50005279
(CHEMBL3114515)
Show SMILES FC(F)(F)c1cccc(CNC(=O)c2nc3c(cccc3[nH]2)-c2ccccc2)c1
Show InChI InChI=1S/C22H16F3N3O/c23-22(24,25)16-9-4-6-14(12-16)13-26-21(29)20-27-18-11-5-10-17(19(18)28-20)15-7-2-1-3-8-15/h1-12H,13H2,(H,26,29)(H,27,28)
Reactome pathway
n/an/an/an/a 256n/an/an/an/a
Merck Research Laboratories
Curated by ChEMBL
Assay Description
Agonist activity at human CB2 receptor expressed in CHO-K1 cells assessed as forskolin-induced cAMP accumulation after 1 hr
Bioorg Med Chem Lett 24: 1218-21 (2014)
Article DOI: 10.1016/j.bmcl.2013.12.068
BindingDB Entry DOI: 10.7270/Q2FJ2J9K
Cannabinoid receptor 1
(Homo sapiens (Human))
BDBM50005279
(CHEMBL3114515)
Show SMILES FC(F)(F)c1cccc(CNC(=O)c2nc3c(cccc3[nH]2)-c2ccccc2)c1
Show InChI InChI=1S/C22H16F3N3O/c23-22(24,25)16-9-4-6-14(12-16)13-26-21(29)20-27-18-11-5-10-17(19(18)28-20)15-7-2-1-3-8-15/h1-12H,13H2,(H,26,29)(H,27,28)
NCI pathway
Reactome pathway
n/an/an/an/a>1.70E+4n/an/an/an/a
Merck Research Laboratories
Curated by ChEMBL
Assay Description
Agonist activity at human CB1 receptor expressed in CHO-K1 cells assessed as forskolin-induced cAMP accumulation after 1 hr
Bioorg Med Chem Lett 24: 1218-21 (2014)
Article DOI: 10.1016/j.bmcl.2013.12.068
BindingDB Entry DOI: 10.7270/Q2FJ2J9K