BDBM50005357 CHEMBL418986
SMILES: [H][C@](O)(C[C@@]([H])(C\C=C\c1ccccc1)C(=O)N[C@]1([H])c2ccccc2C[C@@]1([H])O)[C@]([H])(Cc1ccccc1)NC(=O)OC(C)(C)C
InChI Key: InChIKey=MFSVHROQWVRSOF-CZILFDGYSA-N
Data: 1 IC50
Activity Spreadsheet -- Enzyme Inhibition Constant Data from BindingDB
Found 1 hit for monomerid = 50005357
Trg + Lig
Ki
nM
ΔG°
kcal/mole
IC50
nM
Kd
nM
EC50/IC50
nM
koff
s-1
kon
M-1s-1
pHTemp
°C
Human immunodeficiency virus type 1 protease
(Human immunodeficiency virus type 1)
BDBM50005357
(CHEMBL418986)
Show SMILES [H][C@](O)(C[C@@]([H])(C\C=C\c1ccccc1)C(=O)N[C@]1([H])c2ccccc2C[C@@]1([H])O)[C@]([H])(Cc1ccccc1)NC(=O)OC(C)(C)C
Show InChI InChI=1S/C35H42N2O5/c1-35(2,3)42-34(41)36-29(21-25-15-8-5-9-16-25)30(38)23-27(19-12-17-24-13-6-4-7-14-24)33(40)37-32-28-20-11-10-18-26(28)22-31(32)39/h4-18,20,27,29-32,38-39H,19,21-23H2,1-3H3,(H,36,41)(H,37,40)/b17-12+/t27-,29+,30+,31-,32-/m1/s1
n/an/a 0.230n/an/an/an/an/an/a
Eli Lilly and Company
Curated by ChEMBL
Assay Description
Inhibitory activity against HIV-1 protease.
J Med Chem 43: 3020-32 (2000)
BindingDB Entry DOI: 10.7270/Q2HM59P2