BDBM50005410 CHEMBL139197::CHEMBL2137199
SMILES: OC(c1ccc(c(F)c1)-c1ccc(CN2CCN(Cc3ccncc3)CC2)cc1)(C(F)(F)F)C(F)(F)F
InChI Key: InChIKey=KVHKWAZUPPBMLL-UHFFFAOYSA-N
Data: 1 KI  6 IC50  1 EC50
PDB links: 1 PDB ID matches this monomer.
Activity Spreadsheet -- Enzyme Inhibition Constant Data from BindingDB
Found 8 hits for monomerid = 50005410
Trg + Lig
Ki
nM
ΔG°
kcal/mole
IC50
nM
Kd
nM
EC50/IC50
nM
koff
s-1
kon
M-1s-1
pHTemp
°C
Nuclear receptor ROR-gamma (RORC)
(Homo sapiens (Human))
BDBM50005410
(CHEMBL139197 | CHEMBL2137199)
Show SMILES OC(c1ccc(c(F)c1)-c1ccc(CN2CCN(Cc3ccncc3)CC2)cc1)(C(F)(F)F)C(F)(F)F
Show InChI InChI=1S/C26H24F7N3O/c27-23-15-21(24(37,25(28,29)30)26(31,32)33)5-6-22(23)20-3-1-18(2-4-20)16-35-11-13-36(14-12-35)17-19-7-9-34-10-8-19/h1-10,15,37H,11-14,16-17H2
105n/an/an/an/an/an/an/an/a
Genentech
Curated by ChEMBL
Assay Description
Binding affinity to RORc (unknown origin) by radioligand binding assay
J Med Chem 57: 5871-92 (2014)
Article DOI: 10.1021/jm401901d
BindingDB Entry DOI: 10.7270/Q2M0473Z
3D
3D Structure (crystal)
Nuclear receptor ROR-gamma (RORC)
(Homo sapiens (Human))
BDBM50005410
(CHEMBL139197 | CHEMBL2137199)
Show SMILES OC(c1ccc(c(F)c1)-c1ccc(CN2CCN(Cc3ccncc3)CC2)cc1)(C(F)(F)F)C(F)(F)F
Show InChI InChI=1S/C26H24F7N3O/c27-23-15-21(24(37,25(28,29)30)26(31,32)33)5-6-22(23)20-3-1-18(2-4-20)16-35-11-13-36(14-12-35)17-19-7-9-34-10-8-19/h1-10,15,37H,11-14,16-17H2
n/an/a 420n/an/an/an/an/an/a
Chinese Academy of Sciences
Curated by ChEMBL
Assay Description
Antagonist activity at full-length RORgamma (unknown origin) expressed in 293T cells after 24 hrs by luciferase reporter gene assay
Eur J Med Chem 78: 431-41 (2014)
Article DOI: 10.1016/j.ejmech.2014.03.065
BindingDB Entry DOI: 10.7270/Q2W66N9X
3D
3D Structure (crystal)
Nuclear receptor ROR-gamma (RORC)
(Homo sapiens (Human))
BDBM50005410
(CHEMBL139197 | CHEMBL2137199)
Show SMILES OC(c1ccc(c(F)c1)-c1ccc(CN2CCN(Cc3ccncc3)CC2)cc1)(C(F)(F)F)C(F)(F)F
Show InChI InChI=1S/C26H24F7N3O/c27-23-15-21(24(37,25(28,29)30)26(31,32)33)5-6-22(23)20-3-1-18(2-4-20)16-35-11-13-36(14-12-35)17-19-7-9-34-10-8-19/h1-10,15,37H,11-14,16-17H2
n/an/a 3.54E+3n/an/an/an/an/an/a
Chinese Academy of Sciences
Curated by ChEMBL
Assay Description
Antagonist activity at human His6-tagged RORgamma ligand binding domain (262 to 507 aa) assessed as inhibition of SRC1-4 co-activator peptide recruit...
Eur J Med Chem 78: 431-41 (2014)
Article DOI: 10.1016/j.ejmech.2014.03.065
BindingDB Entry DOI: 10.7270/Q2W66N9X
3D
3D Structure (crystal)
Nuclear receptor ROR-gamma (RORC)
(Homo sapiens (Human))
BDBM50005410
(CHEMBL139197 | CHEMBL2137199)
Show SMILES OC(c1ccc(c(F)c1)-c1ccc(CN2CCN(Cc3ccncc3)CC2)cc1)(C(F)(F)F)C(F)(F)F
Show InChI InChI=1S/C26H24F7N3O/c27-23-15-21(24(37,25(28,29)30)26(31,32)33)5-6-22(23)20-3-1-18(2-4-20)16-35-11-13-36(14-12-35)17-19-7-9-34-10-8-19/h1-10,15,37H,11-14,16-17H2
n/an/a 110n/an/an/an/an/an/a
Jilin University
Curated by ChEMBL
Assay Description
Inhibition of Gal4-RORgamma-LBD (180 to 507 residues) (unknown origin) expressed in HEK293T cells after 24 hrs by dual-luciferase reporter assay
Eur J Med Chem 116: 13-26 (2016)
BindingDB Entry DOI: 10.7270/Q2TT4SVK
3D
3D Structure (crystal)
Nuclear receptor ROR-gamma (RORC)
(Homo sapiens (Human))
BDBM50005410
(CHEMBL139197 | CHEMBL2137199)
Show SMILES OC(c1ccc(c(F)c1)-c1ccc(CN2CCN(Cc3ccncc3)CC2)cc1)(C(F)(F)F)C(F)(F)F
Show InChI InChI=1S/C26H24F7N3O/c27-23-15-21(24(37,25(28,29)30)26(31,32)33)5-6-22(23)20-3-1-18(2-4-20)16-35-11-13-36(14-12-35)17-19-7-9-34-10-8-19/h1-10,15,37H,11-14,16-17H2
n/an/an/an/a 320n/an/an/an/a
Genentech
Curated by ChEMBL
Assay Description
Agonist activity at RoRc-LBD (unknown origin) expressed in HEK293 cells assessed as transcriptional activity by GAL4 reporter assay
J Med Chem 57: 5871-92 (2014)
Article DOI: 10.1021/jm401901d
BindingDB Entry DOI: 10.7270/Q2M0473Z
3D
3D Structure (crystal)
Nuclear receptor ROR-gamma (RORC)
(Homo sapiens (Human))
BDBM50005410
(CHEMBL139197 | CHEMBL2137199)
Show SMILES OC(c1ccc(c(F)c1)-c1ccc(CN2CCN(Cc3ccncc3)CC2)cc1)(C(F)(F)F)C(F)(F)F
Show InChI InChI=1S/C26H24F7N3O/c27-23-15-21(24(37,25(28,29)30)26(31,32)33)5-6-22(23)20-3-1-18(2-4-20)16-35-11-13-36(14-12-35)17-19-7-9-34-10-8-19/h1-10,15,37H,11-14,16-17H2
n/an/a 910n/an/an/an/an/an/a
Jilin University
Curated by ChEMBL
Assay Description
Displacement of N-terminal biotinylated SRC1-4 coactivator peptide from N-terminal His6-fused human RORgamma-LBD (262 to 507 residues) expressed in E...
Eur J Med Chem 116: 13-26 (2016)
BindingDB Entry DOI: 10.7270/Q2TT4SVK
3D
3D Structure (crystal)
Nuclear receptor ROR-gamma (RORC)
(Homo sapiens (Human))
BDBM50005410
(CHEMBL139197 | CHEMBL2137199)
Show SMILES OC(c1ccc(c(F)c1)-c1ccc(CN2CCN(Cc3ccncc3)CC2)cc1)(C(F)(F)F)C(F)(F)F
Show InChI InChI=1S/C26H24F7N3O/c27-23-15-21(24(37,25(28,29)30)26(31,32)33)5-6-22(23)20-3-1-18(2-4-20)16-35-11-13-36(14-12-35)17-19-7-9-34-10-8-19/h1-10,15,37H,11-14,16-17H2
n/an/a 430n/an/an/an/an/an/a
Chinese Academy of Sciences
Curated by ChEMBL
Assay Description
Antagonist activity at Gal4-fused RORgamma (unknown origin) expressed in 293T cells after 24 hrs by luciferase reporter gene assay
Eur J Med Chem 78: 431-41 (2014)
Article DOI: 10.1016/j.ejmech.2014.03.065
BindingDB Entry DOI: 10.7270/Q2W66N9X
3D
3D Structure (crystal)
Nuclear receptor ROR-gamma (RORC)
(Homo sapiens (Human))
BDBM50005410
(CHEMBL139197 | CHEMBL2137199)
Show SMILES OC(c1ccc(c(F)c1)-c1ccc(CN2CCN(Cc3ccncc3)CC2)cc1)(C(F)(F)F)C(F)(F)F
Show InChI InChI=1S/C26H24F7N3O/c27-23-15-21(24(37,25(28,29)30)26(31,32)33)5-6-22(23)20-3-1-18(2-4-20)16-35-11-13-36(14-12-35)17-19-7-9-34-10-8-19/h1-10,15,37H,11-14,16-17H2
n/an/a 150n/an/an/an/an/an/a
Genentech
Curated by ChEMBL
Assay Description
Displacement of [3H]T0901317 from human RoRc expressed in HepG2 cells by scintillation proximity binding assay
J Med Chem 57: 5871-92 (2014)
Article DOI: 10.1021/jm401901d
BindingDB Entry DOI: 10.7270/Q2M0473Z
3D
3D Structure (crystal)