BDBM50005472 CHEMBL141264::CHEMBL3234034
SMILES: CCN1C(=O)c2cccc3c(ccc1c23)S(=O)(=O)Nc1ccc(cc1)N1CCOCC1
InChI Key: InChIKey=YCOXQYUSYKAHEG-UHFFFAOYSA-N
Data: 3 IC50
Activity Spreadsheet -- Enzyme Inhibition Constant Data from BindingDB
Found 3 hits for monomerid = 50005472
Trg + Lig
Ki
nM
ΔG°
kcal/mole
IC50
nM
Kd
nM
EC50/IC50
nM
koff
s-1
kon
M-1s-1
pHTemp
°C
Nuclear receptor ROR-gamma (RORC)
(Homo sapiens (Human))
BDBM50005472
(CHEMBL141264 | CHEMBL3234034)
Show SMILES CCN1C(=O)c2cccc3c(ccc1c23)S(=O)(=O)Nc1ccc(cc1)N1CCOCC1
Show InChI InChI=1S/C23H23N3O4S/c1-2-26-20-10-11-21(18-4-3-5-19(22(18)20)23(26)27)31(28,29)24-16-6-8-17(9-7-16)25-12-14-30-15-13-25/h3-11,24H,2,12-15H2,1H3
n/an/a 340n/an/an/an/an/an/a
Chinese Academy of Sciences
Curated by ChEMBL
Assay Description
Antagonist activity at Gal4-fused RORgamma (unknown origin) expressed in 293T cells after 24 hrs by luciferase reporter gene assay
Eur J Med Chem 78: 431-41 (2014)
Article DOI: 10.1016/j.ejmech.2014.03.065
BindingDB Entry DOI: 10.7270/Q2W66N9X
Nuclear receptor ROR-gamma (RORC)
(Homo sapiens (Human))
BDBM50005472
(CHEMBL141264 | CHEMBL3234034)
Show SMILES CCN1C(=O)c2cccc3c(ccc1c23)S(=O)(=O)Nc1ccc(cc1)N1CCOCC1
Show InChI InChI=1S/C23H23N3O4S/c1-2-26-20-10-11-21(18-4-3-5-19(22(18)20)23(26)27)31(28,29)24-16-6-8-17(9-7-16)25-12-14-30-15-13-25/h3-11,24H,2,12-15H2,1H3
n/an/a 1.22E+4n/an/an/an/an/an/a
Chinese Academy of Sciences
Curated by ChEMBL
Assay Description
Antagonist activity at human His6-tagged RORgamma ligand binding domain (262 to 507 aa) assessed as inhibition of SRC1-4 co-activator peptide recruit...
Eur J Med Chem 78: 431-41 (2014)
Article DOI: 10.1016/j.ejmech.2014.03.065
BindingDB Entry DOI: 10.7270/Q2W66N9X
Nuclear receptor ROR-gamma (RORC)
(Homo sapiens (Human))
BDBM50005472
(CHEMBL141264 | CHEMBL3234034)
Show SMILES CCN1C(=O)c2cccc3c(ccc1c23)S(=O)(=O)Nc1ccc(cc1)N1CCOCC1
Show InChI InChI=1S/C23H23N3O4S/c1-2-26-20-10-11-21(18-4-3-5-19(22(18)20)23(26)27)31(28,29)24-16-6-8-17(9-7-16)25-12-14-30-15-13-25/h3-11,24H,2,12-15H2,1H3
n/an/a 550n/an/an/an/an/an/a
Chinese Academy of Sciences
Curated by ChEMBL
Assay Description
Antagonist activity at full-length RORgamma (unknown origin) expressed in 293T cells after 24 hrs by luciferase reporter gene assay
Eur J Med Chem 78: 431-41 (2014)
Article DOI: 10.1016/j.ejmech.2014.03.065
BindingDB Entry DOI: 10.7270/Q2W66N9X