BDBM50005514 CHEMBL140658::CHEMBL3234242
SMILES: O=C1Nc2ccc(c3cccc1c23)S(=O)(=O)Nc1ccc(cc1)-c1ccccc1
InChI Key: InChIKey=HFOFELOFFLAHFN-UHFFFAOYSA-N
Data: 1 IC50
Activity Spreadsheet -- Enzyme Inhibition Constant Data from BindingDB
Found 1 hit for monomerid = 50005514
Trg + Lig
Ki
nM
ΔG°
kcal/mole
IC50
nM
Kd
nM
EC50/IC50
nM
koff
s-1
kon
M-1s-1
pHTemp
°C
Nuclear receptor ROR-gamma (RORC)
(Homo sapiens (Human))
BDBM50005514
(CHEMBL140658 | CHEMBL3234242)
Show SMILES O=C1Nc2ccc(c3cccc1c23)S(=O)(=O)Nc1ccc(cc1)-c1ccccc1
Show InChI InChI=1S/C23H16N2O3S/c26-23-19-8-4-7-18-21(14-13-20(24-23)22(18)19)29(27,28)25-17-11-9-16(10-12-17)15-5-2-1-3-6-15/h1-14,25H,(H,24,26)
n/an/a 5.93E+3n/an/an/an/an/an/a
Chinese Academy of Sciences
Curated by ChEMBL
Assay Description
Antagonist activity at human His6-tagged RORgamma ligand binding domain (262 to 507 aa) assessed as inhibition of SRC1-4 co-activator peptide recruit...
Eur J Med Chem 78: 431-41 (2014)
Article DOI: 10.1016/j.ejmech.2014.03.065
BindingDB Entry DOI: 10.7270/Q2W66N9X