null
SMILES: [#8]-c1ccc(cc1)-[#6](=[#7]/c1ccccc1)\c1ccc(-[#8])cc1
InChI Key: InChIKey=MGFIKZPNBCCIOL-UHFFFAOYSA-N
PDB links: 1 PDB ID matches this monomer.
Activity Spreadsheet -- Enzyme Inhibition Constant Data from BindingDB
Found 2 hits for monomerid = 50005587
Trg + Lig
Ki
nM
ΔG°
kcal/mole
IC50
nM
Kd
nM
EC50/IC50
nM
koff
s-1
kon
M-1s-1
pHTemp
°C
Estrogen receptor
(Homo sapiens (Human))
BDBM50005587
(CHEMBL138420 | CHEMBL3234612)
Show SMILES [#8]-c1ccc(cc1)-[#6](=[#7]/c1ccccc1)\c1ccc(-[#8])cc1
Show InChI InChI=1S/C19H15NO2/c21-17-10-6-14(7-11-17)19(15-8-12-18(22)13-9-15)20-16-4-2-1-3-5-16/h1-13,21-22H
n/an/an/an/a 3n/an/an/an/a
Key Laboratory of Combinatorial Biosynthesis and Drug Discovery (Wuhan University)
Curated by ChEMBL
Assay Description
Agonist activity at ERalpha (unknown origin) expressed in human HepG2 cells assessed as transcriptional activation after 24 hrs by ERE-luciferase rep...
J Med Chem 57: 3532-45 (2014)
Article DOI: 10.1021/jm500268j
BindingDB Entry DOI: 10.7270/Q2MS3V9N
3D
3D Structure (crystal)
Estrogen receptor beta
(Homo sapiens (Human))
BDBM50005587
(CHEMBL138420 | CHEMBL3234612)
Show SMILES [#8]-c1ccc(cc1)-[#6](=[#7]/c1ccccc1)\c1ccc(-[#8])cc1
Show InChI InChI=1S/C19H15NO2/c21-17-10-6-14(7-11-17)19(15-8-12-18(22)13-9-15)20-16-4-2-1-3-5-16/h1-13,21-22H
n/an/a 13n/an/an/an/an/an/a
Key Laboratory of Combinatorial Biosynthesis and Drug Discovery (Wuhan University)
Curated by ChEMBL
Assay Description
Antagonist activity at ERbeta (unknown origin) expressed in human HepG2 cells assessed as inhibition of 17beta-estradiol-induced transcriptional acti...
J Med Chem 57: 3532-45 (2014)
Article DOI: 10.1021/jm500268j
BindingDB Entry DOI: 10.7270/Q2MS3V9N