BDBM50005598 CHEMBL3234626
SMILES: Oc1ccc(cc1)C(=N/c1ccccc1)\c1ccc(O)cc1O
InChI Key: InChIKey=NGYDXIVYMLSPED-FMQUCBEESA-N
Data: 1 IC50  2 EC50
Activity Spreadsheet -- Enzyme Inhibition Constant Data from BindingDB
Found 3 hits for monomerid = 50005598
Trg + Lig
Ki
nM
ΔG°
kcal/mole
IC50
nM
Kd
nM
EC50/IC50
nM
koff
s-1
kon
M-1s-1
pHTemp
°C
Estradiol receptor beta (ERβ)
(Homo sapiens (Human))
BDBM50005598
(CHEMBL3234626)
Show SMILES Oc1ccc(cc1)C(=N/c1ccccc1)\c1ccc(O)cc1O
Show InChI InChI=1S/C19H15NO3/c21-15-8-6-13(7-9-15)19(20-14-4-2-1-3-5-14)17-11-10-16(22)12-18(17)23/h1-12,21-23H/b20-19+
n/an/a 6n/an/an/an/an/an/a
Key Laboratory of Combinatorial Biosynthesis and Drug Discovery (Wuhan University)
Curated by ChEMBL
Assay Description
Antagonist activity at ERbeta (unknown origin) expressed in human HepG2 cells assessed as inhibition of 17beta-estradiol-induced transcriptional acti...
J Med Chem 57: 3532-45 (2014)
Article DOI: 10.1021/jm500268j
BindingDB Entry DOI: 10.7270/Q2MS3V9N
Estradiol receptor beta (ERβ)
(Homo sapiens (Human))
BDBM50005598
(CHEMBL3234626)
Show SMILES Oc1ccc(cc1)C(=N/c1ccccc1)\c1ccc(O)cc1O
Show InChI InChI=1S/C19H15NO3/c21-15-8-6-13(7-9-15)19(20-14-4-2-1-3-5-14)17-11-10-16(22)12-18(17)23/h1-12,21-23H/b20-19+
n/an/an/an/a 628n/an/an/an/a
Key Laboratory of Combinatorial Biosynthesis and Drug Discovery (Wuhan University)
Curated by ChEMBL
Assay Description
Agonist activity at ERbeta (unknown origin) expressed in human HepG2 cells assessed as transcriptional activation after 24 hrs by ERE-luciferase repo...
J Med Chem 57: 3532-45 (2014)
Article DOI: 10.1021/jm500268j
BindingDB Entry DOI: 10.7270/Q2MS3V9N
Estrogen receptor
(Homo sapiens (Human))
BDBM50005598
(CHEMBL3234626)
Show SMILES Oc1ccc(cc1)C(=N/c1ccccc1)\c1ccc(O)cc1O
Show InChI InChI=1S/C19H15NO3/c21-15-8-6-13(7-9-15)19(20-14-4-2-1-3-5-14)17-11-10-16(22)12-18(17)23/h1-12,21-23H/b20-19+
n/an/an/an/a 7n/an/an/an/a
Key Laboratory of Combinatorial Biosynthesis and Drug Discovery (Wuhan University)
Curated by ChEMBL
Assay Description
Agonist activity at ERalpha (unknown origin) expressed in human HepG2 cells assessed as transcriptional activation after 24 hrs by ERE-luciferase rep...
J Med Chem 57: 3532-45 (2014)
Article DOI: 10.1021/jm500268j
BindingDB Entry DOI: 10.7270/Q2MS3V9N