BDBM50005750 3-Diethylamino-N-[6-(3-diethylamino-propionylamino)-9,10-dioxo-9,10-dihydro-anthracen-2-yl]-propionamide::CHEMBL34683
SMILES: CCN(CC)CCC(=O)Nc1ccc2C(=O)c3cc(NC(=O)CCN(CC)CC)ccc3C(=O)c2c1
InChI Key: InChIKey=LYHXLJHYOVPSQN-UHFFFAOYSA-N
Data: 1 IC50
Activity Spreadsheet -- Enzyme Inhibition Constant Data from BindingDB
Found 1 hit for monomerid = 50005750
Trg + Lig
Ki
nM
ΔG°
kcal/mole
IC50
nM
Kd
nM
EC50/IC50
nM
koff
s-1
kon
M-1s-1
pHTemp
°C
Telomerase reverse transcriptase
(Homo sapiens (Human))
BDBM50005750
(3-Diethylamino-N-[6-(3-diethylamino-propionylamino...)
Show SMILES CCN(CC)CCC(=O)Nc1ccc2C(=O)c3cc(NC(=O)CCN(CC)CC)ccc3C(=O)c2c1
Show InChI InChI=1S/C28H36N4O4/c1-5-31(6-2)15-13-25(33)29-19-9-11-21-23(17-19)27(35)22-12-10-20(18-24(22)28(21)36)30-26(34)14-16-32(7-3)8-4/h9-12,17-18H,5-8,13-16H2,1-4H3,(H,29,33)(H,30,34)
NCI pathway
Reactome pathway
n/an/a 3.50E+3n/an/an/an/an/an/a
Institute of Cancer Research
Curated by ChEMBL
Assay Description
Inhibitory activity of telomerase was measured using the TRAP assay.
J Med Chem 41: 4873-84 (1998)
Article DOI: 10.1021/jm981067o
BindingDB Entry DOI: 10.7270/Q2WW7GSD