BDBM50005862 2-{4-[(2-Amino-4-oxo-3,4-dihydro-quinazolin-6-ylmethyl)-propyl-amino]-benzoylamino}-pentanedioic acid
SMILES: CCCN(Cc1ccc2nc(N)[nH]c(=O)c2c1)c1ccc(cc1)C(=O)NC(CCC([O-])=O)C([O-])=O
InChI Key: InChIKey=WFTUVZIOVCJWQV-UHFFFAOYSA-L
Data: 1 IC50
Activity Spreadsheet -- Enzyme Inhibition Constant Data from BindingDB
Found 1 hit for monomerid = 50005862
Trg + Lig
Ki
nM
ΔG°
kcal/mole
IC50
nM
Kd
nM
EC50/IC50
nM
koff
s-1
kon
M-1s-1
pHTemp
°C
Thymidylate synthase
(Homo sapiens (Human))
BDBM50005862
(2-{4-[(2-Amino-4-oxo-3,4-dihydro-quinazolin-6-ylme...)
Show SMILES CCCN(Cc1ccc2nc(N)[nH]c(=O)c2c1)c1ccc(cc1)C(=O)NC(CCC([O-])=O)C([O-])=O
Show InChI InChI=1S/C24H27N5O6/c1-2-11-29(13-14-3-8-18-17(12-14)22(33)28-24(25)27-18)16-6-4-15(5-7-16)21(32)26-19(23(34)35)9-10-20(30)31/h3-8,12,19H,2,9-11,13H2,1H3,(H,26,32)(H,30,31)(H,34,35)(H3,25,27,28,33)/p-2
NCI pathway
Reactome pathway
n/an/a 68n/an/an/an/an/an/a
Harvard Medical School
Curated by ChEMBL
Assay Description
In vitro inhibition of human thymidylate synthase (TS)
J Med Chem 35: 1578-88 (1992)
BindingDB Entry DOI: 10.7270/Q2028S6J
3D
3D Structure (docked)