BDBM50005895 CHEMBL416614::Carbonic acid 4,5-bis-butoxycarbonyloxy-7-methyl-9,10-dioxo-9,10-dihydro-anthracen-2-yl ester butyl ester
SMILES: CCCCOC(=O)Oc1cc(OC(=O)OCCCC)c2C(=O)c3c(OC(=O)OCCCC)cc(C)cc3C(=O)c2c1
InChI Key: InChIKey=NVDYOLNFHCURBN-UHFFFAOYSA-N
Data: 1 IC50
Activity Spreadsheet -- Enzyme Inhibition Constant Data from BindingDB
Found 1 hit for monomerid = 50005895
Trg + Lig
Ki
nM
ΔG°
kcal/mole
IC50
nM
Kd
nM
EC50/IC50
nM
koff
s-1
kon
M-1s-1
pHTemp
°C
Leukocyte elastase
(Homo sapiens (Human))
BDBM50005895
(CHEMBL416614 | Carbonic acid 4,5-bis-butoxycarbony...)
Show SMILES CCCCOC(=O)Oc1cc(OC(=O)OCCCC)c2C(=O)c3c(OC(=O)OCCCC)cc(C)cc3C(=O)c2c1
Show InChI InChI=1S/C30H34O11/c1-5-8-11-36-28(33)39-19-16-21-25(23(17-19)41-30(35)38-13-10-7-3)27(32)24-20(26(21)31)14-18(4)15-22(24)40-29(34)37-12-9-6-2/h14-17H,5-13H2,1-4H3
Reactome pathway
n/an/a 1.30E+3n/an/an/an/an/an/a
School of Chemistry and Biochemistry
Curated by ChEMBL
Assay Description
In vitro inhibition of human leukocyte elastase.
J Med Chem 35: 1597-605 (1992)
BindingDB Entry DOI: 10.7270/Q2QN67D7