BDBM50005899 1-Hydroxy-6,8-dimethoxy-2-methyl-anthraquinone::CHEMBL41539
SMILES: COc1cc(OC)c2C(=O)c3c(O)c(C)ccc3C(=O)c2c1
InChI Key: InChIKey=ZGXXIZXPGKHJTM-UHFFFAOYSA-N
Data: 1 IC50
Activity Spreadsheet -- Enzyme Inhibition Constant Data from BindingDB
Found 1 hit for monomerid = 50005899
Trg + Lig
Ki
nM
ΔG°
kcal/mole
IC50
nM
Kd
nM
EC50/IC50
nM
koff
s-1
kon
M-1s-1
pHTemp
°C
Leukocyte elastase
(Homo sapiens (Human))
BDBM50005899
(1-Hydroxy-6,8-dimethoxy-2-methyl-anthraquinone | C...)
Show SMILES COc1cc(OC)c2C(=O)c3c(O)c(C)ccc3C(=O)c2c1
Show InChI InChI=1S/C17H14O5/c1-8-4-5-10-14(15(8)18)17(20)13-11(16(10)19)6-9(21-2)7-12(13)22-3/h4-7,18H,1-3H3
Reactome pathway
n/an/a 1.30E+4n/an/an/an/an/an/a
School of Chemistry and Biochemistry
Curated by ChEMBL
Assay Description
Compound was tested for the enzyme inhibitory activity against Human Leukocyte Elastase (HLE) at 27 uM concentration
J Med Chem 35: 1597-605 (1992)
BindingDB Entry DOI: 10.7270/Q2QN67D7