BDBM50005920 AJULEMIC ACID::Ajulemic Acid
SMILES: [H][C@@]12CC(=CC[C@@]1([H])C(C)(C)Oc1cc(cc(O)c21)C(C)(C)CCCCCC)C(O)=O
InChI Key: InChIKey=YCHYFHOSGQABSW-RTBURBONSA-N
Data: 3 KI  1 EC50
PDB links: 1 PDB ID matches this monomer.
Activity Spreadsheet -- Enzyme Inhibition Constant Data from BindingDB
Found 4 hits for monomerid = 50005920
Trg + Lig
Ki
nM
ΔG°
kcal/mole
IC50
nM
Kd
nM
EC50/IC50
nM
koff
s-1
kon
M-1s-1
pHTemp
°C
Cannabinoid receptor 1
(Homo sapiens (Human))
BDBM50005920
(AJULEMIC ACID | Ajulemic Acid)
Show SMILES [H][C@@]12CC(=CC[C@@]1([H])C(C)(C)Oc1cc(cc(O)c21)C(C)(C)CCCCCC)C(O)=O |r,c:3|
Show InChI InChI=1S/C25H36O4/c1-6-7-8-9-12-24(2,3)17-14-20(26)22-18-13-16(23(27)28)10-11-19(18)25(4,5)29-21(22)15-17/h10,14-15,18-19,26H,6-9,11-13H2,1-5H3,(H,27,28)/t18-,19-/m1/s1
NCI pathway
Reactome pathway
5.70n/an/an/an/an/an/an/an/a
The University of Massachusetts Medical School
Curated by ChEMBL
Assay Description
Binding affinity to CB1 receptor (unknown origin)
Bioorg Med Chem 22: 2830-43 (2014)
Article DOI: 10.1016/j.bmc.2014.03.038
BindingDB Entry DOI: 10.7270/Q2SF2XQK
Cannabinoid receptor 1
(Homo sapiens (Human))
BDBM50005920
(AJULEMIC ACID | Ajulemic Acid)
Show SMILES [H][C@@]12CC(=CC[C@@]1([H])C(C)(C)Oc1cc(cc(O)c21)C(C)(C)CCCCCC)C(O)=O |r,c:3|
Show InChI InChI=1S/C25H36O4/c1-6-7-8-9-12-24(2,3)17-14-20(26)22-18-13-16(23(27)28)10-11-19(18)25(4,5)29-21(22)15-17/h10,14-15,18-19,26H,6-9,11-13H2,1-5H3,(H,27,28)/t18-,19-/m1/s1
NCI pathway
Reactome pathway
32n/an/an/an/an/an/an/an/a
Arena Pharmaceuticals
Curated by ChEMBL
Assay Description
Binding affinity to human CB1 receptor
Cell Chem Biol 56: 8224-56 (2013)
Article DOI: 10.1021/jm4005626
BindingDB Entry DOI: 10.7270/Q2B859M5
Cannabinoid receptor 2
(Homo sapiens (Human))
BDBM50005920
(AJULEMIC ACID | Ajulemic Acid)
Show SMILES [H][C@@]12CC(=CC[C@@]1([H])C(C)(C)Oc1cc(cc(O)c21)C(C)(C)CCCCCC)C(O)=O |r,c:3|
Show InChI InChI=1S/C25H36O4/c1-6-7-8-9-12-24(2,3)17-14-20(26)22-18-13-16(23(27)28)10-11-19(18)25(4,5)29-21(22)15-17/h10,14-15,18-19,26H,6-9,11-13H2,1-5H3,(H,27,28)/t18-,19-/m1/s1
Reactome pathway
171n/an/an/an/an/an/an/an/a
Arena Pharmaceuticals
Curated by ChEMBL
Assay Description
Binding affinity to human CB2 receptor
Cell Chem Biol 56: 8224-56 (2013)
Article DOI: 10.1021/jm4005626
BindingDB Entry DOI: 10.7270/Q2B859M5
Cannabinoid receptor 1
(Homo sapiens (Human))
BDBM50005920
(AJULEMIC ACID | Ajulemic Acid)
Show SMILES [H][C@@]12CC(=CC[C@@]1([H])C(C)(C)Oc1cc(cc(O)c21)C(C)(C)CCCCCC)C(O)=O |r,c:3|
Show InChI InChI=1S/C25H36O4/c1-6-7-8-9-12-24(2,3)17-14-20(26)22-18-13-16(23(27)28)10-11-19(18)25(4,5)29-21(22)15-17/h10,14-15,18-19,26H,6-9,11-13H2,1-5H3,(H,27,28)/t18-,19-/m1/s1
NCI pathway
Reactome pathway
n/an/an/an/a 927n/an/an/an/a
Arena Pharmaceuticals
Curated by ChEMBL
Assay Description
Agonist activity at CB1 receptor (unknown origin) assessed as cAMP production
Cell Chem Biol 56: 8224-56 (2013)
Article DOI: 10.1021/jm4005626
BindingDB Entry DOI: 10.7270/Q2B859M5