BDBM50006260 CHEMBL3234676
SMILES: CCC(C)Cn1c(nc2cc(ccc12)S(=O)(=O)c1ccnc(F)c1)C(C)(C)C
InChI Key: InChIKey=FDJGWSOCJLZQPS-UHFFFAOYSA-N
Data: 2 EC50
Activity Spreadsheet -- Enzyme Inhibition Constant Data from BindingDB
Found 2 hits for monomerid = 50006260
Trg + Lig
Ki
nM
ΔG°
kcal/mole
IC50
nM
Kd
nM
EC50/IC50
nM
koff
s-1
kon
M-1s-1
pHTemp
°C
Cannabinoid receptor 1
(Homo sapiens (Human))
BDBM50006260
(CHEMBL3234676)
Show SMILES CCC(C)Cn1c(nc2cc(ccc12)S(=O)(=O)c1ccnc(F)c1)C(C)(C)C
Show InChI InChI=1S/C21H26FN3O2S/c1-6-14(2)13-25-18-8-7-15(11-17(18)24-20(25)21(3,4)5)28(26,27)16-9-10-23-19(22)12-16/h7-12,14H,6,13H2,1-5H3
NCI pathway
Reactome pathway
n/an/an/an/a>1.00E+4n/an/an/an/a
Arena Pharmaceuticals
Curated by ChEMBL
Assay Description
Agonist activity at human CB1 receptor transfected in CHO-K1 cells assessed as cAMP change
Cell Chem Biol 56: 8224-56 (2013)
Article DOI: 10.1021/jm4005626
BindingDB Entry DOI: 10.7270/Q2B859M5
Cannabinoid receptor 2
(Homo sapiens (Human))
BDBM50006260
(CHEMBL3234676)
Show SMILES CCC(C)Cn1c(nc2cc(ccc12)S(=O)(=O)c1ccnc(F)c1)C(C)(C)C
Show InChI InChI=1S/C21H26FN3O2S/c1-6-14(2)13-25-18-8-7-15(11-17(18)24-20(25)21(3,4)5)28(26,27)16-9-10-23-19(22)12-16/h7-12,14H,6,13H2,1-5H3
Reactome pathway
n/an/an/an/a 0.260n/an/an/an/a
Arena Pharmaceuticals
Curated by ChEMBL
Assay Description
Agonist activity at human CB2 receptor transfected in CHO-K1 cells assessed as cAMP change
Cell Chem Biol 56: 8224-56 (2013)
Article DOI: 10.1021/jm4005626
BindingDB Entry DOI: 10.7270/Q2B859M5