BDBM50006330 3-{2-[2-(2-Amino-acetylamino)-5-guanidino-pentanoylamino]-acetylamino}-N-(1-carboxy-2-hydroxy-ethyl)-succinamic acid::CHEMBL417553::Gly-Arg-Gly-Asp-Ser
SMILES: NCC(=O)N[C@@H](CCCNC(N)=N)C(=O)NCC(=O)N[C@@H](CC(O)=O)C(=O)N[C@@H](CO)C(O)=O
InChI Key: InChIKey=RGNVSYKVCGAEHK-GUBZILKMSA-N
Data: 3 IC50
Activity Spreadsheet -- Enzyme Inhibition Constant Data from BindingDB
Found 3 hits for monomerid = 50006330
Trg + Lig
Ki
nM
ΔG°
kcal/mole
IC50
nM
Kd
nM
EC50/IC50
nM
koff
s-1
kon
M-1s-1
pHTemp
°C
Integrin alpha-IIb/beta-3
(Homo sapiens (Human))
BDBM50006330
(3-{2-[2-(2-Amino-acetylamino)-5-guanidino-pentanoy...)
Show SMILES NCC(=O)N[C@@H](CCCNC(N)=N)C(=O)NCC(=O)N[C@@H](CC(O)=O)C(=O)N[C@@H](CO)C(O)=O
Show InChI InChI=1S/C17H30N8O9/c18-5-11(27)23-8(2-1-3-21-17(19)20)14(31)22-6-12(28)24-9(4-13(29)30)15(32)25-10(7-26)16(33)34/h8-10,26H,1-7,18H2,(H,22,31)(H,23,27)(H,24,28)(H,25,32)(H,29,30)(H,33,34)(H4,19,20,21)/t8-,9-,10-/m0/s1
n/an/a 1.60E+5n/an/an/an/an/an/a
Genentech
Curated by ChEMBL
Assay Description
Inhibition of ADP-induced platelet aggregation in human platelet-rich plasma
J Med Chem 35: 2040-8 (1992)
BindingDB Entry DOI: 10.7270/Q2S1833Q
Integrin alpha-IIb/beta-3
(Homo sapiens (Human))
BDBM50006330
(3-{2-[2-(2-Amino-acetylamino)-5-guanidino-pentanoy...)
Show SMILES NCC(=O)N[C@@H](CCCNC(N)=N)C(=O)NCC(=O)N[C@@H](CC(O)=O)C(=O)N[C@@H](CO)C(O)=O
Show InChI InChI=1S/C17H30N8O9/c18-5-11(27)23-8(2-1-3-21-17(19)20)14(31)22-6-12(28)24-9(4-13(29)30)15(32)25-10(7-26)16(33)34/h8-10,26H,1-7,18H2,(H,22,31)(H,23,27)(H,24,28)(H,25,32)(H,29,30)(H,33,34)(H4,19,20,21)/t8-,9-,10-/m0/s1
n/an/a 120n/an/an/an/an/an/a
Universite Catholique de Louvain
Curated by ChEMBL
Assay Description
Inhibition of human integrin alpha2b beta3 receptor by fibrinogen competitive binding assay
J Med Chem 52: 7029-43 (2009)
Article DOI: 10.1021/jm901133z
BindingDB Entry DOI: 10.7270/Q2GB2507
Integrin alpha-IIb/beta-3
(Homo sapiens (Human))
BDBM50006330
(3-{2-[2-(2-Amino-acetylamino)-5-guanidino-pentanoy...)
Show SMILES NCC(=O)N[C@@H](CCCNC(N)=N)C(=O)NCC(=O)N[C@@H](CC(O)=O)C(=O)N[C@@H](CO)C(O)=O
Show InChI InChI=1S/C17H30N8O9/c18-5-11(27)23-8(2-1-3-21-17(19)20)14(31)22-6-12(28)24-9(4-13(29)30)15(32)25-10(7-26)16(33)34/h8-10,26H,1-7,18H2,(H,22,31)(H,23,27)(H,24,28)(H,25,32)(H,29,30)(H,33,34)(H4,19,20,21)/t8-,9-,10-/m0/s1
n/an/a 133n/an/an/an/an/an/a
Genentech
Curated by ChEMBL
Assay Description
The compound was tested for the inhibition of fibrinogen receptor
J Med Chem 35: 2040-8 (1992)
BindingDB Entry DOI: 10.7270/Q2S1833Q