BDBM50006469 CHEMBL69956::[8-Oxo-7-(5-trifluoromethyl-benzothiazol-2-ylmethyl)-7,8-dihydro-pyrido[2,3-d]pyridazin-5-yl]-acetic acid
SMILES: OC(=O)Cc1nn(Cc2nc3cc(ccc3s2)C(F)(F)F)c(=O)c2ncccc12
InChI Key: InChIKey=BWGDCBBYQOFUJM-UHFFFAOYSA-N
Data: 2 IC50
Activity Spreadsheet -- Enzyme Inhibition Constant Data from BindingDB
Found 2 hits for monomerid = 50006469
Trg + Lig
Ki
nM
ΔG°
kcal/mole
IC50
nM
Kd
nM
EC50/IC50
nM
koff
s-1
kon
M-1s-1
pHTemp
°C
Aldose reductase
(Homo sapiens (Human))
BDBM50006469
(CHEMBL69956 | [8-Oxo-7-(5-trifluoromethyl-benzothi...)
Show SMILES OC(=O)Cc1nn(Cc2nc3cc(ccc3s2)C(F)(F)F)c(=O)c2ncccc12
Show InChI InChI=1S/C18H11F3N4O3S/c19-18(20,21)9-3-4-13-12(6-9)23-14(29-13)8-25-17(28)16-10(2-1-5-22-16)11(24-25)7-15(26)27/h1-6H,7-8H2,(H,26,27)
n/an/a 2.10n/an/an/an/an/an/a
Y. B. Chavan College of Pharmacy
Curated by ChEMBL
Assay Description
Inhibition of human Aldose reductase
Bioorg Med Chem 27: 3979-3997 (2019)
Article DOI: 10.1016/j.bmc.2019.07.050
Aldose reductase (AR)
(Homo sapiens (Human))
BDBM50006469
(CHEMBL69956 | [8-Oxo-7-(5-trifluoromethyl-benzothi...)
Show SMILES OC(=O)Cc1nn(Cc2nc3cc(ccc3s2)C(F)(F)F)c(=O)c2ncccc12
Show InChI InChI=1S/C18H11F3N4O3S/c19-18(20,21)9-3-4-13-12(6-9)23-14(29-13)8-25-17(28)16-10(2-1-5-22-16)11(24-25)7-15(26)27/h1-6H,7-8H2,(H,26,27)
n/an/a 2.10n/an/an/an/an/an/a
Pfizer Inc
Curated by ChEMBL
Assay Description
Inhibitory activity against aldose reductase isolated from human placenta
J Med Chem 35: 2155-62 (1992)
BindingDB Entry DOI: 10.7270/Q2KK99RR