BDBM50006765 CHEMBL3236575
SMILES: CN[C@@H]1CCN(C1)c1cc(nc(N)n1)C1CCC1
InChI Key: InChIKey=CEDPAKWFXHNETN-SNVBAGLBSA-N
Data: 1 KI  1 EC50
Activity Spreadsheet -- Enzyme Inhibition Constant Data from BindingDB
Found 2 hits for monomerid = 50006765
Trg + Lig
Ki
nM
ΔG°
kcal/mole
IC50
nM
Kd
nM
EC50/IC50
nM
koff
s-1
kon
M-1s-1
pHTemp
°C
Histamine H4 receptor
(Homo sapiens (Human))
BDBM50006765
(CHEMBL3236575)
Show SMILES CN[C@@H]1CCN(C1)c1cc(nc(N)n1)C1CCC1 |r|
Show InChI InChI=1S/C13H21N5/c1-15-10-5-6-18(8-10)12-7-11(9-3-2-4-9)16-13(14)17-12/h7,9-10,15H,2-6,8H2,1H3,(H2,14,16,17)/t10-/m1/s1
Reactome pathway
2.40n/an/an/an/an/an/an/an/a
Janssen Research& Development, LLC
Curated by ChEMBL
Assay Description
Displacement of [3H]histamine from human recombinant histamine H4 receptor expressed in SK-N-MC cells after 45 mins by competition binding analysis
J Med Chem 57: 2429-39 (2014)
Article DOI: 10.1021/jm401727m
BindingDB Entry DOI: 10.7270/Q25H7HSH
Histamine H4 receptor
(Homo sapiens (Human))
BDBM50006765
(CHEMBL3236575)
Show SMILES CN[C@@H]1CCN(C1)c1cc(nc(N)n1)C1CCC1 |r|
Show InChI InChI=1S/C13H21N5/c1-15-10-5-6-18(8-10)12-7-11(9-3-2-4-9)16-13(14)17-12/h7,9-10,15H,2-6,8H2,1H3,(H2,14,16,17)/t10-/m1/s1
Reactome pathway
n/an/an/an/a>1.00E+4n/an/an/an/a
Janssen Research& Development, LLC
Curated by ChEMBL
Assay Description
Agonist activity at human H4 receptor
J Med Chem 57: 2429-39 (2014)
Article DOI: 10.1021/jm401727m
BindingDB Entry DOI: 10.7270/Q25H7HSH