BDBM50006895 CHEMBL3237243
SMILES: Cc1c(Cc2ccc(=O)n(Cc3ccc(F)cc3)n2)c2cc(F)ccc2n1CC(O)=O
InChI Key: InChIKey=ONAHUFZOBQRSPA-UHFFFAOYSA-N
Data: 1 IC50
Activity Spreadsheet -- Enzyme Inhibition Constant Data from BindingDB
Found 1 hit for monomerid = 50006895
Trg + Lig
Ki
nM
ΔG°
kcal/mole
IC50
nM
Kd
nM
EC50/IC50
nM
koff
s-1
kon
M-1s-1
pHTemp
°C
G protein-coupled receptor 44
(Homo sapiens (Human))
BDBM50006895
(CHEMBL3237243)
Show SMILES Cc1c(Cc2ccc(=O)n(Cc3ccc(F)cc3)n2)c2cc(F)ccc2n1CC(O)=O
Show InChI InChI=1S/C23H19F2N3O3/c1-14-19(20-10-17(25)6-8-21(20)27(14)13-23(30)31)11-18-7-9-22(29)28(26-18)12-15-2-4-16(24)5-3-15/h2-10H,11-13H2,1H3,(H,30,31)
Reactome pathway
n/an/a 6n/an/an/an/an/an/a
Pfizer Inc.
Curated by ChEMBL
Assay Description
Antagonist activity at human recombinant CRTh2 expressed in CHO-K1 cells by cAMP TR FRET assay
J Med Chem 57: 1299-322 (2014)
Article DOI: 10.1021/jm401509e
BindingDB Entry DOI: 10.7270/Q21V5GGH