BDBM50006912 (2-Butyl-5-chloro-3-{4-[2-(2H-tetrazol-5-yl)-cyclohept-1-enyl]-benzyl}-3H-imidazol-4-yl)-methanol::CHEMBL328552
SMILES: CCCCc1nc(Cl)c(CO)n1Cc1ccc(cc1)C1=C(CCCCC1)c1nnn[nH]1
InChI Key: InChIKey=WTYFVDTUGDZIQC-UHFFFAOYSA-N
Data: 1 IC50
Activity Spreadsheet -- Enzyme Inhibition Constant Data from BindingDB
Found 1 hit for monomerid = 50006912
Trg + Lig
Ki
nM
ΔG°
kcal/mole
IC50
nM
Kd
nM
EC50/IC50
nM
koff
s-1
kon
M-1s-1
pHTemp
°C
Angiotensin II AT1B
(RAT)
BDBM50006912
((2-Butyl-5-chloro-3-{4-[2-(2H-tetrazol-5-yl)-cyclo...)
Show SMILES CCCCc1nc(Cl)c(CO)n1Cc1ccc(cc1)C1=C(CCCCC1)c1nnn[nH]1 |t:21|
Show InChI InChI=1S/C23H29ClN6O/c1-2-3-9-21-25-22(24)20(15-31)30(21)14-16-10-12-17(13-11-16)18-7-5-4-6-8-19(18)23-26-28-29-27-23/h10-13,31H,2-9,14-15H2,1H3,(H,26,27,28,29)
Reactome pathway
n/an/a 2.80E+3n/an/an/an/an/an/a
Lilly Research Laboratories
Curated by ChEMBL
Assay Description
Concentration of the compound required to inhibit binding of radioligand [125I]-AII to angiotensin II receptor, type 1 in rat adrenal glomerulosa tis...
J Med Chem 35: 2658-67 (1992)
BindingDB Entry DOI: 10.7270/Q2930S4R