BDBM50006989 CHEMBL292450::N-Adamantan-1-yl-N'-(4-fluoro-phenyl)-guanidine
SMILES: NC(Nc1ccc(F)cc1)=NC12CC3CC(CC(C3)C1)C2
InChI Key: InChIKey=WHLZEIVTZVIPTL-UHFFFAOYSA-N
Data: 1 IC50
Activity Spreadsheet -- Enzyme Inhibition Constant Data from BindingDB
Found 1 hit for monomerid = 50006989
Trg + Lig
Ki
nM
ΔG°
kcal/mole
IC50
nM
Kd
nM
EC50/IC50
nM
koff
s-1
kon
M-1s-1
pHTemp
°C
Sigma non-opioid intracellular receptor 1
(Homo sapiens (Human))
BDBM50006989
(CHEMBL292450 | N-Adamantan-1-yl-N'-(4-fluoro-pheny...)
Show SMILES NC(Nc1ccc(F)cc1)=NC12CC3CC(CC(C3)C1)C2 |w:10.11,TLB:18:17:20:13.12.14,18:13:20:17.19.16,THB:16:17:12:15.20.14,16:15:12:17.19.18|
Show InChI InChI=1S/C17H22FN3/c18-14-1-3-15(4-2-14)20-16(19)21-17-8-11-5-12(9-17)7-13(6-11)10-17/h1-4,11-13H,5-10H2,(H3,19,20,21)
n/an/a 9n/an/an/an/an/an/a
Institutions
Curated by ChEMBL
Assay Description
Displacement of [3H]-DTG from sigma opioid receptor of homogenized guinea pig whole brain
J Med Chem 34: 1867-70 (1991)
BindingDB Entry DOI: 10.7270/Q21N802D