BDBM50007401 1-Phenyl-4-(4-phenyl-butyl)-piperazine::CHEMBL85879
SMILES: C(CCc1ccccc1)CN1CCN(CC1)c1ccccc1
InChI Key: InChIKey=BGDZXIKVCVQJFR-UHFFFAOYSA-N
Data: 2 KI  3 IC50
Activity Spreadsheet -- Enzyme Inhibition Constant Data from BindingDB
Found 5 hits for monomerid = 50007401
Trg + Lig
Ki
nM
ΔG°
kcal/mole
IC50
nM
Kd
nM
EC50/IC50
nM
koff
s-1
kon
M-1s-1
pHTemp
°C
5-hydroxytryptamine receptor 1A
(Rattus norvegicus (rat))
BDBM50007401
(1-Phenyl-4-(4-phenyl-butyl)-piperazine | CHEMBL858...)
Show SMILES C(CCc1ccccc1)CN1CCN(CC1)c1ccccc1
Show InChI InChI=1S/C20H26N2/c1-3-9-19(10-4-1)11-7-8-14-21-15-17-22(18-16-21)20-12-5-2-6-13-20/h1-6,9-10,12-13H,7-8,11,14-18H2
1n/an/an/an/an/an/an/an/a
Virginia Commonwealth University
Curated by ChEMBL
Assay Description
Tested for binding affinity against 5-hydroxytryptamine 1A receptor from rat frontal cortical regions using [3H]-8-OH-DPAT as radioligand
J Med Chem 36: 2519-25 (1993)
BindingDB Entry DOI: 10.7270/Q2QF8RZ9
Sigma non-opioid intracellular receptor 1
(Homo sapiens (Human))
BDBM50007401
(1-Phenyl-4-(4-phenyl-butyl)-piperazine | CHEMBL858...)
Show SMILES C(CCc1ccccc1)CN1CCN(CC1)c1ccccc1
Show InChI InChI=1S/C20H26N2/c1-3-9-19(10-4-1)11-7-8-14-21-15-17-22(18-16-21)20-12-5-2-6-13-20/h1-6,9-10,12-13H,7-8,11,14-18H2
2.60n/an/an/an/an/an/an/an/a
Virginia Commonwealth University
Curated by ChEMBL
Assay Description
Binding affinity of the compound towards sigma receptor in guinea pig brain membranes using [3H]-DTG as radioligand
J Med Chem 34: 3360-5 (1992)
BindingDB Entry DOI: 10.7270/Q2MC8XZR
D(1A) dopamine receptor
(RAT)
BDBM50007401
(1-Phenyl-4-(4-phenyl-butyl)-piperazine | CHEMBL858...)
Show SMILES C(CCc1ccccc1)CN1CCN(CC1)c1ccccc1
Show InChI InChI=1S/C20H26N2/c1-3-9-19(10-4-1)11-7-8-14-21-15-17-22(18-16-21)20-12-5-2-6-13-20/h1-6,9-10,12-13H,7-8,11,14-18H2
n/an/a 2.82E+3n/an/an/an/an/an/a
Virginia Commonwealth University
Curated by ChEMBL
Assay Description
Binding affinity of the compound towards Dopamine receptor D1 in rat membranes using [3H]-SCH-23,390 as radioligand
J Med Chem 34: 3360-5 (1992)
BindingDB Entry DOI: 10.7270/Q2MC8XZR
D(2) dopamine receptor
(Rattus norvegicus (rat))
BDBM50007401
(1-Phenyl-4-(4-phenyl-butyl)-piperazine | CHEMBL858...)
Show SMILES C(CCc1ccccc1)CN1CCN(CC1)c1ccccc1
Show InChI InChI=1S/C20H26N2/c1-3-9-19(10-4-1)11-7-8-14-21-15-17-22(18-16-21)20-12-5-2-6-13-20/h1-6,9-10,12-13H,7-8,11,14-18H2
Reactome pathway
n/an/a 45n/an/an/an/an/an/a
Virginia Commonwealth University
Curated by ChEMBL
Assay Description
Compound was tested for its binding affinity towards dopamine receptor D2 by using [3H]-domperidone as radioligand
J Med Chem 34: 3360-5 (1992)
BindingDB Entry DOI: 10.7270/Q2MC8XZR
NMDA receptor subunit 2C (GluN2C)
(Rattus norvegicus (Rat))
BDBM50007401
(1-Phenyl-4-(4-phenyl-butyl)-piperazine | CHEMBL858...)
Show SMILES C(CCc1ccccc1)CN1CCN(CC1)c1ccccc1
Show InChI InChI=1S/C20H26N2/c1-3-9-19(10-4-1)11-7-8-14-21-15-17-22(18-16-21)20-12-5-2-6-13-20/h1-6,9-10,12-13H,7-8,11,14-18H2
n/an/a>1.00E+4n/an/an/an/an/an/a
Virginia Commonwealth University
Curated by ChEMBL
Assay Description
Compound was tested for its affinity towards PCP receptor in rat brain membrane [3H]-MK-801 as radioligand
J Med Chem 34: 3360-5 (1992)
BindingDB Entry DOI: 10.7270/Q2MC8XZR