BDBM50007657 CHEMBL3233139
SMILES: CC(C)(C)[C@@H](CS(=O)(=O)C(C)(C)C)N1[C@@H]([C@H](O[C@H](CC(O)=O)C1=O)c1cccc(Cl)c1)c1ccc(Cl)cc1
InChI Key: InChIKey=FMXNELLNMOXQLN-WMMXXEOUSA-N
Data: 2 IC50
Activity Spreadsheet -- Enzyme Inhibition Constant Data from BindingDB
Found 2 hits for monomerid = 50007657
Trg + Lig
Ki
nM
ΔG°
kcal/mole
IC50
nM
Kd
nM
EC50/IC50
nM
koff
s-1
kon
M-1s-1
pHTemp
°C
E3 ubiquitin-protein ligase Mdm2
(Homo sapiens (Human))
BDBM50007657
(CHEMBL3233139)
Show SMILES CC(C)(C)[C@@H](CS(=O)(=O)C(C)(C)C)N1[C@@H]([C@H](O[C@H](CC(O)=O)C1=O)c1cccc(Cl)c1)c1ccc(Cl)cc1 |r|
Show InChI InChI=1S/C28H35Cl2NO6S/c1-27(2,3)22(16-38(35,36)28(4,5)6)31-24(17-10-12-19(29)13-11-17)25(18-8-7-9-20(30)14-18)37-21(26(31)34)15-23(32)33/h7-14,21-22,24-25H,15-16H2,1-6H3,(H,32,33)/t21-,22-,24-,25-/m1/s1
NCI pathway
Reactome pathway
n/an/a 5.10n/an/an/an/an/an/a
Amgen Inc.
Curated by ChEMBL
Assay Description
Binding affinity to GST-thrombin-tagged human MDM2 (1 to 188) expressed in Escherichia coli assessed as inhibition of interaction with p53 in buffer ...
J Med Chem 57: 2472-88 (2014)
Article DOI: 10.1021/jm401767k
BindingDB Entry DOI: 10.7270/Q2C24XZZ
E3 ubiquitin-protein ligase Mdm2
(Homo sapiens (Human))
BDBM50007657
(CHEMBL3233139)
Show SMILES CC(C)(C)[C@@H](CS(=O)(=O)C(C)(C)C)N1[C@@H]([C@H](O[C@H](CC(O)=O)C1=O)c1cccc(Cl)c1)c1ccc(Cl)cc1 |r|
Show InChI InChI=1S/C28H35Cl2NO6S/c1-27(2,3)22(16-38(35,36)28(4,5)6)31-24(17-10-12-19(29)13-11-17)25(18-8-7-9-20(30)14-18)37-21(26(31)34)15-23(32)33/h7-14,21-22,24-25H,15-16H2,1-6H3,(H,32,33)/t21-,22-,24-,25-/m1/s1
NCI pathway
Reactome pathway
n/an/a 0.5n/an/an/an/an/an/a
Amgen Inc.
Curated by ChEMBL
Assay Description
Binding affinity to GST-thrombin-tagged human MDM2 (1 to 188) expressed in Escherichia coli assessed as inhibition of interaction with p53 in serum f...
J Med Chem 57: 2472-88 (2014)
Article DOI: 10.1021/jm401767k
BindingDB Entry DOI: 10.7270/Q2C24XZZ