BDBM50007738 CHEMBL3233750
SMILES: CCNC(=O)c1noc2CCN(Cc3cc(Cl)c(O)cc3O)Cc12
InChI Key: InChIKey=QEUHHJSQQWEODS-UHFFFAOYSA-N
Data: 1 IC50
Activity Spreadsheet -- Enzyme Inhibition Constant Data from BindingDB
Found 1 hit for monomerid = 50007738
Trg + Lig
Ki
nM
ΔG°
kcal/mole
IC50
nM
Kd
nM
EC50/IC50
nM
koff
s-1
kon
M-1s-1
pHTemp
°C
Heat shock protein HSP 90-alpha
(Homo sapiens (Human))
BDBM50007738
(CHEMBL3233750)
Show SMILES CCNC(=O)c1noc2CCN(Cc3cc(Cl)c(O)cc3O)Cc12
Show InChI InChI=1S/C16H18ClN3O4/c1-2-18-16(23)15-10-8-20(4-3-14(10)24-19-15)7-9-5-11(17)13(22)6-12(9)21/h5-6,21-22H,2-4,7-8H2,1H3,(H,18,23)
NCI pathway
Reactome pathway
n/an/a 1.40E+3n/an/an/an/an/an/a
Universit£ degli Studi di Ferrara
Curated by ChEMBL
Assay Description
Displacement of GM-FTC from Hsp90-alpha (unknown origin) after 4 hrs by fluorescence polarization assay
Eur J Med Chem 76: 53-60 (2014)
Article DOI: 10.1016/j.ejmech.2014.01.056
BindingDB Entry DOI: 10.7270/Q2V40WQX