BDBM50007753 CHEMBL3233763
SMILES: CN(C)CCCN(C)CC(=O)Nc1cc2c(Nc3ccc(F)c(Cl)c3)ncnc2s1
InChI Key: InChIKey=IASJFAFPMHBSJO-UHFFFAOYSA-N
Data: 1 IC50
Activity Spreadsheet -- Enzyme Inhibition Constant Data from BindingDB
Found 1 hit for monomerid = 50007753
Trg + Lig
Ki
nM
ΔG°
kcal/mole
IC50
nM
Kd
nM
EC50/IC50
nM
koff
s-1
kon
M-1s-1
pHTemp
°C
Epidermal growth factor receptor
(Homo sapiens (Human))
BDBM50007753
(CHEMBL3233763)
Show SMILES CN(C)CCCN(C)CC(=O)Nc1cc2c(Nc3ccc(F)c(Cl)c3)ncnc2s1
Show InChI InChI=1S/C20H24ClFN6OS/c1-27(2)7-4-8-28(3)11-17(29)26-18-10-14-19(23-12-24-20(14)30-18)25-13-5-6-16(22)15(21)9-13/h5-6,9-10,12H,4,7-8,11H2,1-3H3,(H,26,29)(H,23,24,25)
n/an/a 5.22E+3n/an/an/an/an/an/a
Chinese Academy of Sciences
Curated by ChEMBL
Assay Description
Inhibition of wild type EGFR domain (unknown origin) expressed in baculovirus expression system using Poly(Glu:Tyr)4:1 substrate after 60 mins by ELI...
Bioorg Med Chem 22: 2366-78 (2014)
Article DOI: 10.1016/j.bmc.2014.01.035
BindingDB Entry DOI: 10.7270/Q2QC051F