BDBM50007787 CHEMBL3233795
SMILES: Fc1ccc(Nc2ncnc3sc(NC(=O)\C=C\CN4CCC5(CC4)OCCO5)cc23)cc1Cl
InChI Key: InChIKey=ALIUINIUQNOYBC-OWOJBTEDSA-N
Data: 1 IC50
Activity Spreadsheet -- Enzyme Inhibition Constant Data from BindingDB
Found 1 hit for monomerid = 50007787
Trg + Lig
Ki
nM
ΔG°
kcal/mole
IC50
nM
Kd
nM
EC50/IC50
nM
koff
s-1
kon
M-1s-1
pHTemp
°C
Epidermal growth factor receptor
(Homo sapiens (Human))
BDBM50007787
(CHEMBL3233795)
Show SMILES Fc1ccc(Nc2ncnc3sc(NC(=O)\C=C\CN4CCC5(CC4)OCCO5)cc23)cc1Cl
Show InChI InChI=1S/C23H23ClFN5O3S/c24-17-12-15(3-4-18(17)25)28-21-16-13-20(34-22(16)27-14-26-21)29-19(31)2-1-7-30-8-5-23(6-9-30)32-10-11-33-23/h1-4,12-14H,5-11H2,(H,29,31)(H,26,27,28)/b2-1+
n/an/a 2n/an/an/an/an/an/a
Chinese Academy of Sciences
Curated by ChEMBL
Assay Description
Inhibition of wild type EGFR domain (unknown origin) expressed in baculovirus expression system using Poly(Glu:Tyr)4:1 substrate after 60 mins by ELI...
Bioorg Med Chem 22: 2366-78 (2014)
Article DOI: 10.1016/j.bmc.2014.01.035
BindingDB Entry DOI: 10.7270/Q2QC051F