BDBM50007828 2-(1-{2-[2-(4-Amino-butyrylamino)-3-phenyl-propionylamino]-3-phenyl-propionyl}-6-oxo-1,7-diaza-spiro[4.4]non-7-yl)-4-methyl-pentanoic acid (1-carbamoyl-3-methylsulfanyl-propyl)-amide::CHEMBL292435
SMILES: CSCC[C@H](NC(=O)[C@H](CC(C)C)N1CCC2(CCCN2C(=O)[C@H](Cc2ccccc2)NC(=O)[C@H](Cc2ccccc2)NC(=O)CCCN)C1=O)C(N)=O
InChI Key: InChIKey=KMXAKISPLJTOKV-VWMUTNEVSA-N
Data: 2 EC50
Activity Spreadsheet -- Enzyme Inhibition Constant Data from BindingDB
Found 2 hits for monomerid = 50007828
Trg + Lig
Ki
nM
ΔG°
kcal/mole
IC50
nM
Kd
nM
EC50/IC50
nM
koff
s-1
kon
M-1s-1
pHTemp
°C
Substance-K receptor
(Rattus norvegicus (Rat))
BDBM50007828
(2-(1-{2-[2-(4-Amino-butyrylamino)-3-phenyl-propion...)
Show SMILES CSCC[C@H](NC(=O)[C@H](CC(C)C)N1CCC2(CCCN2C(=O)[C@H](Cc2ccccc2)NC(=O)[C@H](Cc2ccccc2)NC(=O)CCCN)C1=O)C(N)=O
Show InChI InChI=1S/C40H57N7O6S/c1-27(2)24-33(37(51)44-30(35(42)49)17-23-54-3)46-22-19-40(39(46)53)18-11-21-47(40)38(52)32(26-29-14-8-5-9-15-29)45-36(50)31(43-34(48)16-10-20-41)25-28-12-6-4-7-13-28/h4-9,12-15,27,30-33H,10-11,16-26,41H2,1-3H3,(H2,42,49)(H,43,48)(H,44,51)(H,45,50)/t30-,31-,32-,33-,40?/m0/s1
Reactome pathway
n/an/an/an/a>500n/an/an/an/a
Glaxo Group Research Ltd.
Curated by ChEMBL
Assay Description
Agonist activity at tachykinin receptor 2 in the rat colon muscularis mucosae
J Med Chem 33: 1848-51 (1990)
BindingDB Entry DOI: 10.7270/Q2668C5C
Substance-P receptor
(GUINEA PIG)
BDBM50007828
(2-(1-{2-[2-(4-Amino-butyrylamino)-3-phenyl-propion...)
Show SMILES CSCC[C@H](NC(=O)[C@H](CC(C)C)N1CCC2(CCCN2C(=O)[C@H](Cc2ccccc2)NC(=O)[C@H](Cc2ccccc2)NC(=O)CCCN)C1=O)C(N)=O
Show InChI InChI=1S/C40H57N7O6S/c1-27(2)24-33(37(51)44-30(35(42)49)17-23-54-3)46-22-19-40(39(46)53)18-11-21-47(40)38(52)32(26-29-14-8-5-9-15-29)45-36(50)31(43-34(48)16-10-20-41)25-28-12-6-4-7-13-28/h4-9,12-15,27,30-33H,10-11,16-26,41H2,1-3H3,(H2,42,49)(H,43,48)(H,44,51)(H,45,50)/t30-,31-,32-,33-,40?/m0/s1
n/an/an/an/a>2.00E+4n/an/an/an/a
Glaxo Group Research Ltd.
Curated by ChEMBL
Assay Description
Agonistic activity at tachykinin receptor 1 receptor in guinea pig ileum longitudinal smooth muscle
J Med Chem 33: 1848-51 (1990)
BindingDB Entry DOI: 10.7270/Q2668C5C