BDBM50008019 5-Chloro-1-(2-hydroxy-ethoxymethyl)-6-phenylselanyl-1H-pyrimidine-2,4-dione::CHEMBL112227
SMILES: OCCOCn1c([Se]c2ccccc2)c(Cl)c(=O)[nH]c1=O
InChI Key: InChIKey=OZRCGWMZQRHJED-UHFFFAOYSA-N
Data: 1 IC50
Activity Spreadsheet -- Enzyme Inhibition Constant Data from BindingDB
Found 1 hit for monomerid = 50008019
Trg + Lig
Ki
nM
ΔG°
kcal/mole
IC50
nM
Kd
nM
EC50/IC50
nM
koff
s-1
kon
M-1s-1
pHTemp
°C
Human immunodeficiency virus type 1 reverse transcriptase
(Human immunodeficiency virus 1)
BDBM50008019
(5-Chloro-1-(2-hydroxy-ethoxymethyl)-6-phenylselany...)
Show SMILES OCCOCn1c([Se]c2ccccc2)c(Cl)c(=O)[nH]c1=O
Show InChI InChI=1S/C13H13ClN2O4Se/c14-10-11(18)15-13(19)16(8-20-7-6-17)12(10)21-9-4-2-1-3-5-9/h1-5,17H,6-8H2,(H,15,18,19)
n/an/a>1.00E+5n/an/an/an/an/an/a
Veterans Affairs Medical Center
Curated by ChEMBL
Assay Description
Inhibition of HIV-1 reverse transcriptase from peripheral blood mononuclear cells
J Med Chem 34: 3305-9 (1991)
BindingDB Entry DOI: 10.7270/Q2DR2TFF