BDBM50008254 CHEMBL3234765
SMILES: CCNC(=O)c1nnn(c1-c1ccc(CN2CCCC(O)C2)cc1)-c1cc(C(C)C)c(O)cc1O
InChI Key: InChIKey=WZMXCKPOKMINNZ-UHFFFAOYSA-N
Data: 1 IC50
Activity Spreadsheet -- Enzyme Inhibition Constant Data from BindingDB
Found 1 hit for monomerid = 50008254
Trg + Lig
Ki
nM
ΔG°
kcal/mole
IC50
nM
Kd
nM
EC50/IC50
nM
koff
s-1
kon
M-1s-1
pHTemp
°C
Heat shock protein HSP 90-alpha
(Homo sapiens (Human))
BDBM50008254
(CHEMBL3234765)
Show SMILES CCNC(=O)c1nnn(c1-c1ccc(CN2CCCC(O)C2)cc1)-c1cc(C(C)C)c(O)cc1O
Show InChI InChI=1S/C26H33N5O4/c1-4-27-26(35)24-25(18-9-7-17(8-10-18)14-30-11-5-6-19(32)15-30)31(29-28-24)21-12-20(16(2)3)22(33)13-23(21)34/h7-10,12-13,16,19,32-34H,4-6,11,14-15H2,1-3H3,(H,27,35)
NCI pathway
Reactome pathway
n/an/a 23n/an/an/an/an/an/a
Universit£ degli Studi di Siena
Curated by ChEMBL
Assay Description
Displacement of GM-FITC from full-length recombinant human Hsp90-alpha after 4 hrs by fluorescence polarization assay
J Med Chem 57: 2258-74 (2014)
Article DOI: 10.1021/jm401536b
BindingDB Entry DOI: 10.7270/Q2JQ12HR