BDBM50008264 CHEMBL3234775
SMILES: CCNC(=O)c1nnn(c1-c1ccc(CN2CCN(C)CC2)cc1)-c1cc(C(C)C)c(O)cc1O
InChI Key: InChIKey=PMFMGZJFZPEYMR-UHFFFAOYSA-N
Data: 1 IC50
Activity Spreadsheet -- Enzyme Inhibition Constant Data from BindingDB
Found 1 hit for monomerid = 50008264
Trg + Lig
Ki
nM
ΔG°
kcal/mole
IC50
nM
Kd
nM
EC50/IC50
nM
koff
s-1
kon
M-1s-1
pHTemp
°C
Heat shock protein HSP 90-alpha
(Homo sapiens (Human))
BDBM50008264
(CHEMBL3234775)
Show SMILES CCNC(=O)c1nnn(c1-c1ccc(CN2CCN(C)CC2)cc1)-c1cc(C(C)C)c(O)cc1O
Show InChI InChI=1S/C26H34N6O3/c1-5-27-26(35)24-25(19-8-6-18(7-9-19)16-31-12-10-30(4)11-13-31)32(29-28-24)21-14-20(17(2)3)22(33)15-23(21)34/h6-9,14-15,17,33-34H,5,10-13,16H2,1-4H3,(H,27,35)
NCI pathway
Reactome pathway
n/an/a<5n/an/an/an/an/an/a
Universit£ degli Studi di Siena
Curated by ChEMBL
Assay Description
Displacement of GM-FITC from full-length recombinant human Hsp90-alpha after 4 hrs by fluorescence polarization assay
J Med Chem 57: 2258-74 (2014)
Article DOI: 10.1021/jm401536b
BindingDB Entry DOI: 10.7270/Q2JQ12HR