BDBM50008306 CHEMBL3235155
SMILES: COCC(C)NCc1csc(NC(=O)c2cc(Oc3ccc(cc3)S(C)(=O)=O)cc(c2)-c2ncccc2C)n1
InChI Key: InChIKey=GXPZFRYBPOFRID-UHFFFAOYSA-N
Data: 1 EC50
Activity Spreadsheet -- Enzyme Inhibition Constant Data from BindingDB
Found 1 hit for monomerid = 50008306
Trg + Lig
Ki
nM
ΔG°
kcal/mole
IC50
nM
Kd
nM
EC50/IC50
nM
koff
s-1
kon
M-1s-1
pHTemp
°C
Hexokinase-4
(Homo sapiens (Human))
BDBM50008306
(CHEMBL3235155)
Show SMILES COCC(C)NCc1csc(NC(=O)c2cc(Oc3ccc(cc3)S(C)(=O)=O)cc(c2)-c2ncccc2C)n1
Show InChI InChI=1S/C28H30N4O5S2/c1-18-6-5-11-29-26(18)20-12-21(14-24(13-20)37-23-7-9-25(10-8-23)39(4,34)35)27(33)32-28-31-22(17-38-28)15-30-19(2)16-36-3/h5-14,17,19,30H,15-16H2,1-4H3,(H,31,32,33)
NCI pathway
Reactome pathway
n/an/an/an/a 8n/an/an/an/a
Yuhan Research Institute
Curated by ChEMBL
Assay Description
Activation of recombinant human pancreatic glucokinase using 10 mM glucose by spectrophotometry
Bioorg Med Chem 22: 2280-93 (2014)
Article DOI: 10.1016/j.bmc.2014.02.009
BindingDB Entry DOI: 10.7270/Q2959K3X