null
SMILES: Cc1c(Sc2cccc(Cl)c2)n(COCCO)c(=O)[nH]c1=O
InChI Key: InChIKey=XAZQEUGIDTXFHD-UHFFFAOYSA-N
Activity Spreadsheet -- Enzyme Inhibition Constant Data from BindingDB
Found 1 hit for monomerid = 50008336
Trg + Lig
Ki
nM
ΔG°
kcal/mole
IC50
nM
Kd
nM
EC50/IC50
nM
koff
s-1
kon
M-1s-1
pHTemp
°C
Reverse transcriptase/RNaseH
(Human immunodeficiency virus 1)
BDBM50008336
(6-(3-Chloro-phenylsulfanyl)-1-(2-hydroxy-ethoxymet...)
Show SMILES Cc1c(Sc2cccc(Cl)c2)n(COCCO)c(=O)[nH]c1=O
Show InChI InChI=1S/C14H15ClN2O4S/c1-9-12(19)16-14(20)17(8-21-6-5-18)13(9)22-11-4-2-3-10(15)7-11/h2-4,7,18H,5-6,8H2,1H3,(H,16,19,20)
n/an/an/an/a 1.30E+4n/an/an/an/a
Université d'Orléans
Curated by ChEMBL
Assay Description
Inhibitory concentration against HIV-1 reverse transcriptase
J Med Chem 40: 4257-64 (1998)
Article DOI: 10.1021/jm970110p
BindingDB Entry DOI: 10.7270/Q2WS8SC3