null
SMILES: Cc1cccc(Sc2c(C)c(=O)[nH]c(=O)n2COCCO)c1
InChI Key: InChIKey=GBMQKZSGGJRJQY-UHFFFAOYSA-N
Activity Spreadsheet -- Enzyme Inhibition Constant Data from BindingDB
Found 1 hit for monomerid = 50008339
Trg + Lig
Ki
nM
ΔG°
kcal/mole
IC50
nM
Kd
nM
EC50/IC50
nM
koff
s-1
kon
M-1s-1
pHTemp
°C
Reverse transcriptase/RNaseH
(Human immunodeficiency virus 1)
BDBM50008339
(1-(2-Hydroxy-ethoxymethyl)-5-methyl-6-m-tolylsulfa...)
Show SMILES Cc1cccc(Sc2c(C)c(=O)[nH]c(=O)n2COCCO)c1
Show InChI InChI=1S/C15H18N2O4S/c1-10-4-3-5-12(8-10)22-14-11(2)13(19)16-15(20)17(14)9-21-7-6-18/h3-5,8,18H,6-7,9H2,1-2H3,(H,16,19,20)
n/an/an/an/a 2.60E+3n/an/an/an/a
Université d'Orléans
Curated by ChEMBL
Assay Description
Inhibitory concentration against HIV-1 reverse transcriptase
J Med Chem 40: 4257-64 (1998)
Article DOI: 10.1021/jm970110p
BindingDB Entry DOI: 10.7270/Q2WS8SC3