null
SMILES: COc1cccc(Sc2c(C)c(=O)[nH]c(=O)n2COCCO)c1
InChI Key: InChIKey=VDJSZCISAWKVQA-UHFFFAOYSA-N
Activity Spreadsheet -- Enzyme Inhibition Constant Data from BindingDB
Found 1 hit for monomerid = 50008342
Trg + Lig
Ki
nM
ΔG°
kcal/mole
IC50
nM
Kd
nM
EC50/IC50
nM
koff
s-1
kon
M-1s-1
pHTemp
°C
Reverse transcriptase/RNaseH
(Human immunodeficiency virus 1)
BDBM50008342
(1-(2-Hydroxy-ethoxymethyl)-6-(3-methoxy-phenylsulf...)
Show SMILES COc1cccc(Sc2c(C)c(=O)[nH]c(=O)n2COCCO)c1
Show InChI InChI=1S/C15H18N2O5S/c1-10-13(19)16-15(20)17(9-22-7-6-18)14(10)23-12-5-3-4-11(8-12)21-2/h3-5,8,18H,6-7,9H2,1-2H3,(H,16,19,20)
n/an/an/an/a 2.20E+4n/an/an/an/a
Université d'Orléans
Curated by ChEMBL
Assay Description
Inhibitory concentration against HIV-1 reverse transcriptase
J Med Chem 40: 4257-64 (1998)
Article DOI: 10.1021/jm970110p
BindingDB Entry DOI: 10.7270/Q2WS8SC3