BDBM50008360 CHEMBL3235181
SMILES: CCOC(=O)c1sc(NC(=O)CNC(=O)CC(c2ccccc2)c2ccccc2)nc1C
InChI Key: InChIKey=GQERFPVUCBAZTD-UHFFFAOYSA-N
Data: 1 IC50
Activity Spreadsheet -- Enzyme Inhibition Constant Data from BindingDB
Found 1 hit for monomerid = 50008360
Trg + Lig
Ki
nM
ΔG°
kcal/mole
IC50
nM
Kd
nM
EC50/IC50
nM
koff
s-1
kon
M-1s-1
pHTemp
°C
Casein kinase I isoform delta
(Homo sapiens (Human))
BDBM50008360
(CHEMBL3235181)
Show SMILES CCOC(=O)c1sc(NC(=O)CNC(=O)CC(c2ccccc2)c2ccccc2)nc1C
Show InChI InChI=1S/C24H25N3O4S/c1-3-31-23(30)22-16(2)26-24(32-22)27-21(29)15-25-20(28)14-19(17-10-6-4-7-11-17)18-12-8-5-9-13-18/h4-13,19H,3,14-15H2,1-2H3,(H,25,28)(H,26,27,29)
n/an/a 3.79E+3n/an/an/an/an/an/a
CSIC
Curated by ChEMBL
Assay Description
Inhibition of human recombinant CK-1delta using casein as substrate after 60 mins by Kinase-Glo assay
J Med Chem 57: 2755-72 (2014)
Article DOI: 10.1021/jm500065f
BindingDB Entry DOI: 10.7270/Q21N82NV