BDBM50008362 CHEMBL3235183
SMILES: Clc1cccc(CC(=O)Nc2nc3ccccc3s2)c1
InChI Key: InChIKey=BMKZSCWTKMUFTI-UHFFFAOYSA-N
Data: 1 IC50
Activity Spreadsheet -- Enzyme Inhibition Constant Data from BindingDB
Found 1 hit for monomerid = 50008362
Trg + Lig
Ki
nM
ΔG°
kcal/mole
IC50
nM
Kd
nM
EC50/IC50
nM
koff
s-1
kon
M-1s-1
pHTemp
°C
Casein kinase I isoform delta
(Homo sapiens (Human))
BDBM50008362
(CHEMBL3235183)
Show SMILES Clc1cccc(CC(=O)Nc2nc3ccccc3s2)c1
Show InChI InChI=1S/C15H11ClN2OS/c16-11-5-3-4-10(8-11)9-14(19)18-15-17-12-6-1-2-7-13(12)20-15/h1-8H,9H2,(H,17,18,19)
n/an/a 850n/an/an/an/an/an/a
CSIC
Curated by ChEMBL
Assay Description
Inhibition of human recombinant CK-1delta using casein as substrate after 60 mins by Kinase-Glo assay
J Med Chem 57: 2755-72 (2014)
Article DOI: 10.1021/jm500065f
BindingDB Entry DOI: 10.7270/Q21N82NV