BDBM50008367 CHEMBL3235186
SMILES: O=C(CNC(=O)C(c1ccccc1)c1ccccc1)Nc1nc2ccccc2s1
InChI Key: InChIKey=MXGTVPZOWQAFSI-UHFFFAOYSA-N
Data: 1 IC50
Activity Spreadsheet -- Enzyme Inhibition Constant Data from BindingDB
Found 1 hit for monomerid = 50008367
Trg + Lig
Ki
nM
ΔG°
kcal/mole
IC50
nM
Kd
nM
EC50/IC50
nM
koff
s-1
kon
M-1s-1
pHTemp
°C
Casein kinase I isoform delta
(Homo sapiens (Human))
BDBM50008367
(CHEMBL3235186)
Show SMILES O=C(CNC(=O)C(c1ccccc1)c1ccccc1)Nc1nc2ccccc2s1
Show InChI InChI=1S/C23H19N3O2S/c27-20(26-23-25-18-13-7-8-14-19(18)29-23)15-24-22(28)21(16-9-3-1-4-10-16)17-11-5-2-6-12-17/h1-14,21H,15H2,(H,24,28)(H,25,26,27)
n/an/a 1.93E+3n/an/an/an/an/an/a
CSIC
Curated by ChEMBL
Assay Description
Inhibition of human recombinant CK-1delta using casein as substrate after 60 mins by Kinase-Glo assay
J Med Chem 57: 2755-72 (2014)
Article DOI: 10.1021/jm500065f
BindingDB Entry DOI: 10.7270/Q21N82NV