BDBM50008393 CHEMBL3235198
SMILES: O=C(Nc1nc2ccccc2s1)C(c1ccccc1)c1ccccc1
InChI Key: InChIKey=PJRVHIKCKKZKKS-UHFFFAOYSA-N
Data: 1 IC50
Activity Spreadsheet -- Enzyme Inhibition Constant Data from BindingDB
Found 1 hit for monomerid = 50008393
Trg + Lig
Ki
nM
ΔG°
kcal/mole
IC50
nM
Kd
nM
EC50/IC50
nM
koff
s-1
kon
M-1s-1
pHTemp
°C
Casein kinase I isoform delta
(Homo sapiens (Human))
BDBM50008393
(CHEMBL3235198)
Show SMILES O=C(Nc1nc2ccccc2s1)C(c1ccccc1)c1ccccc1
Show InChI InChI=1S/C21H16N2OS/c24-20(23-21-22-17-13-7-8-14-18(17)25-21)19(15-9-3-1-4-10-15)16-11-5-2-6-12-16/h1-14,19H,(H,22,23,24)
n/an/a 1.96E+3n/an/an/an/an/an/a
CSIC
Curated by ChEMBL
Assay Description
Inhibition of human recombinant CK-1delta using casein as substrate after 60 mins by Kinase-Glo assay
J Med Chem 57: 2755-72 (2014)
Article DOI: 10.1021/jm500065f
BindingDB Entry DOI: 10.7270/Q21N82NV