BDBM50008411 CHEMBL3235545
SMILES: FC(F)(F)c1ccc2nc(NC(=O)Cc3ccc(Cl)cc3)sc2c1
InChI Key: InChIKey=FFCHXVZAEOJLBQ-UHFFFAOYSA-N
Data: 1 IC50
Activity Spreadsheet -- Enzyme Inhibition Constant Data from BindingDB
Found 1 hit for monomerid = 50008411
Trg + Lig
Ki
nM
ΔG°
kcal/mole
IC50
nM
Kd
nM
EC50/IC50
nM
koff
s-1
kon
M-1s-1
pHTemp
°C
Casein kinase I isoform delta
(Homo sapiens (Human))
BDBM50008411
(CHEMBL3235545)
Show SMILES FC(F)(F)c1ccc2nc(NC(=O)Cc3ccc(Cl)cc3)sc2c1
Show InChI InChI=1S/C16H10ClF3N2OS/c17-11-4-1-9(2-5-11)7-14(23)22-15-21-12-6-3-10(16(18,19)20)8-13(12)24-15/h1-6,8H,7H2,(H,21,22,23)
n/an/a 65n/an/an/an/an/an/a
CSIC
Curated by ChEMBL
Assay Description
Inhibition of human recombinant CK-1delta using casein as substrate after 60 mins by Kinase-Glo assay
J Med Chem 57: 2755-72 (2014)
Article DOI: 10.1021/jm500065f
BindingDB Entry DOI: 10.7270/Q21N82NV