BDBM50008418 CHEMBL3235549
SMILES: COc1ccccc1CC(=O)Nc1nc2ccc(Cl)cc2s1
InChI Key: InChIKey=AWDNHSXDWVCJCP-UHFFFAOYSA-N
Data: 1 IC50
Activity Spreadsheet -- Enzyme Inhibition Constant Data from BindingDB
Found 1 hit for monomerid = 50008418
Trg + Lig
Ki
nM
ΔG°
kcal/mole
IC50
nM
Kd
nM
EC50/IC50
nM
koff
s-1
kon
M-1s-1
pHTemp
°C
Casein kinase I isoform delta
(Homo sapiens (Human))
BDBM50008418
(CHEMBL3235549)
Show SMILES COc1ccccc1CC(=O)Nc1nc2ccc(Cl)cc2s1
Show InChI InChI=1S/C16H13ClN2O2S/c1-21-13-5-3-2-4-10(13)8-15(20)19-16-18-12-7-6-11(17)9-14(12)22-16/h2-7,9H,8H2,1H3,(H,18,19,20)
n/an/a 320n/an/an/an/an/an/a
CSIC
Curated by ChEMBL
Assay Description
Inhibition of human recombinant CK-1delta using casein as substrate after 60 mins by Kinase-Glo assay
J Med Chem 57: 2755-72 (2014)
Article DOI: 10.1021/jm500065f
BindingDB Entry DOI: 10.7270/Q21N82NV